ยซ Up

amm11262 dev Error ๐Ÿ”ฅ

๐Ÿ“… (2021-12-16 03:29:46 UTC)

Context

# Packages matching: installed
# Name                   # Installed # Synopsis
base-bigarray            base
base-threads             base
base-unix                base
conf-findutils           1           Virtual package relying on findutils
conf-gmp                 3           Virtual package relying on a GMP lib system installation
coq                      dev         Formal proof management system
dune                     2.9.1       Fast, portable, and opinionated build system
ocaml                    4.05.0      The OCaml compiler (virtual package)
ocaml-base-compiler      4.05.0      Official 4.05.0 release
ocaml-config             1           OCaml Switch Configuration
ocaml-secondary-compiler 4.08.1-1    OCaml 4.08.1 Secondary Switch Compiler
ocamlfind                1.9.1       A library manager for OCaml
ocamlfind-secondary      1.9.1       Adds support for ocaml-secondary-compiler to ocamlfind
zarith                   1.12        Implements arithmetic and logical operations over arbitrary-precision integers
# opam file:
opam-version: "2.0"
maintainer: "dev@clarus.me"
homepage: "https://github.com/coq-contribs/amm11262"
license: "LGPL"
build: [
  ["coq_makefile" "-f" "Make" "-o" "Makefile"]
  [make "-j%{jobs}%"]
]
install: [make "install"]
remove: ["rm" "-R" "%{lib}%/coq/user-contrib/AMM11262"]
depends: [
  "ocaml"
  "coq" {= "dev"}
]
tags: [ "keyword:american mathematical monthly problem 11262" "date:2007-04" ]
authors: [ "Tonny Hurkens (paper proof) <hurkens@sci.kun.nl>" "Milad Niqui (Coq files) <milad@cs.ru.nl>" ]
synopsis: "Problem 11262 of The American Mathematical Monthly."
description: """
Formalisation of Tonny Hurkens' proof of the problem
11262 of The American Mathematical Monthly 113(10), Dec. 2006
(see the README files)"""
flags: light-uninstall
url {
  src: "git+https://github.com/coq-contribs/amm11262.git#master"
}

Lint

Command
true
Return code
0

Dry install ๐Ÿœ๏ธ

Dry install with the current Coq version:

Command
opam install -y --show-action coq-amm11262.dev coq.dev
Return code
0

Dry install without Coq/switch base, to test if the problem was incompatibility with the current Coq/OCaml version:

Command
true
Return code
0

Install dependencies

Command
opam list; echo; ulimit -Sv 4000000; timeout 4h opam install -y --deps-only coq-amm11262.dev coq.dev
Return code
0
Duration
22 s

Install ๐Ÿš€

Command
opam list; echo; ulimit -Sv 16000000; timeout 4h opam install -y coq-amm11262.dev coq.dev
Return code
7936
Duration
41 s
Output
# Packages matching: installed
# Name                   # Installed # Synopsis
base-bigarray            base
base-threads             base
base-unix                base
conf-findutils           1           Virtual package relying on findutils
conf-gmp                 3           Virtual package relying on a GMP lib system installation
coq                      dev         Formal proof management system
dune                     2.9.1       Fast, portable, and opinionated build system
ocaml                    4.05.0      The OCaml compiler (virtual package)
ocaml-base-compiler      4.05.0      Official 4.05.0 release
ocaml-config             1           OCaml Switch Configuration
ocaml-secondary-compiler 4.08.1-1    OCaml 4.08.1 Secondary Switch Compiler
ocamlfind                1.9.1       A library manager for OCaml
ocamlfind-secondary      1.9.1       Adds support for ocaml-secondary-compiler to ocamlfind
zarith                   1.12        Implements arithmetic and logical operations over arbitrary-precision integers
[NOTE] Package coq is already installed (current version is dev).
The following actions will be performed:
  - install coq-amm11262 dev
<><> Gathering sources ><><><><><><><><><><><><><><><><><><><><><><><><><><><><>
[coq-amm11262.dev] synchronised from git+https://github.com/coq-contribs/amm11262.git#master
<><> Processing actions <><><><><><><><><><><><><><><><><><><><><><><><><><><><>
[ERROR] The compilation of coq-amm11262 failed at "/home/bench/.opam/opam-init/hooks/sandbox.sh build make -j7".
#=== ERROR while compiling coq-amm11262.dev ===================================#
# context              2.0.1 | linux/x86_64 | ocaml-base-compiler.4.05.0 | file:///home/bench/run/opam-coq-archive/extra-dev
# path                 ~/.opam/ocaml-base-compiler.4.05.0/.opam-switch/build/coq-amm11262.dev
# command              ~/.opam/opam-init/hooks/sandbox.sh build make -j7
# exit-code            2
# env-file             ~/.opam/log/coq-amm11262-13935-865888.env
# output-file          ~/.opam/log/coq-amm11262-13935-865888.out
### output ###
# [...]
# COQC unicode_format/utf_AMM11262.v
# COQC ascii_format/AMM11262.v
# File "./unicode_format/utf_AMM11262.v", line 9, characters 0-27:
# Error: Cannot find a physical path bound to logical path Omega.
# 
# File "./ascii_format/AMM11262.v", line 9, characters 0-27:
# Error: Cannot find a physical path bound to logical path Omega.
# 
# make[1]: *** [Makefile:764: unicode_format/utf_AMM11262.vo] Error 1
# make[1]: *** Waiting for unfinished jobs....
# make[1]: *** [Makefile:764: ascii_format/AMM11262.vo] Error 1
# make: *** [Makefile:387: all] Error 2
<><> Error report <><><><><><><><><><><><><><><><><><><><><><><><><><><><><><><>
+- The following actions failed
| - build coq-amm11262 dev
+- 
- No changes have been performed
# Run eval $(opam env) to update the current shell environment

Installation size

No files were installed.

Uninstall ๐Ÿงน

Command
true
Return code
0
Missing removes
none
Wrong removes
none