ยซ Up

extructures 0.1.0 Error ๐Ÿ”ฅ

๐Ÿ“… (2021-12-16 03:29:46 UTC)

Context

# Packages matching: installed
# Name                   # Installed # Synopsis
base-bigarray            base
base-threads             base
base-unix                base
conf-findutils           1           Virtual package relying on findutils
conf-gmp                 3           Virtual package relying on a GMP lib system installation
coq                      dev         Formal proof management system
dune                     2.9.1       Fast, portable, and opinionated build system
ocaml                    4.05.0      The OCaml compiler (virtual package)
ocaml-base-compiler      4.05.0      Official 4.05.0 release
ocaml-config             1           OCaml Switch Configuration
ocaml-secondary-compiler 4.08.1-1    OCaml 4.08.1 Secondary Switch Compiler
ocamlfind                1.9.1       A library manager for OCaml
ocamlfind-secondary      1.9.1       Adds support for ocaml-secondary-compiler to ocamlfind
zarith                   1.12        Implements arithmetic and logical operations over arbitrary-precision integers
# opam file:
opam-version: "2.0"
maintainer: "arthur.aa@gmail.com"
homepage: "https://github.com/arthuraa/extructures"
dev-repo: "git+https://github.com/arthuraa/extructures.git"
bug-reports: "https://github.com/arthuraa/extructures/issues"
authors: ["Arthur Azevedo de Amorim"]
license: "MIT"
build: [
  ["coq_makefile" "-f" "_CoqProject" "-o" "Makefile"]
  [make "-j%{jobs}%"]
]
install: [
  [make "install"]
]
remove: ["rm" "-R" "%{lib}%/coq/user-contrib/extructures"]
depends: [
  "ocaml"
  "coq" {(>= "8.7" & < "8.9~") | (= "dev")}
  "coq-mathcomp-ssreflect" {(>= "1.6" & < "1.8~") | (= "dev")}
]
tags: [
  "keyword:finite maps"
  "keyword:extensionality"
  "category:Computer Science/Data Types and Data Structures"
  "date:2018-04-26"
  "logpath:extructures"
]
synopsis: "Finite data structures with extensional reasoning"
flags: light-uninstall
url {
  src: "https://github.com/arthuraa/extructures/archive/v0.1.0.tar.gz"
  checksum: "md5=e28ebcddf02cc35b5e70d5318f617183"
}

Lint

Command
true
Return code
0

Dry install ๐Ÿœ๏ธ

Dry install with the current Coq version:

Command
opam install -y --show-action coq-extructures.0.1.0 coq.dev
Return code
0

Dry install without Coq/switch base, to test if the problem was incompatibility with the current Coq/OCaml version:

Command
true
Return code
0

Install dependencies

Command
opam list; echo; ulimit -Sv 4000000; timeout 4h opam install -y --deps-only coq-extructures.0.1.0 coq.dev
Return code
0
Duration
2 m 59 s

Install ๐Ÿš€

Command
opam list; echo; ulimit -Sv 16000000; timeout 4h opam install -y -v coq-extructures.0.1.0 coq.dev
Return code
7936
Duration
16 s
Output
# Packages matching: installed
# Name                   # Installed # Synopsis
base-bigarray            base
base-threads             base
base-unix                base
conf-findutils           1           Virtual package relying on findutils
conf-gmp                 3           Virtual package relying on a GMP lib system installation
coq                      dev         Formal proof management system
coq-mathcomp-ssreflect   dev         Small Scale Reflection
dune                     2.9.1       Fast, portable, and opinionated build system
ocaml                    4.05.0      The OCaml compiler (virtual package)
ocaml-base-compiler      4.05.0      Official 4.05.0 release
ocaml-config             1           OCaml Switch Configuration
ocaml-secondary-compiler 4.08.1-1    OCaml 4.08.1 Secondary Switch Compiler
ocamlfind                1.9.1       A library manager for OCaml
ocamlfind-secondary      1.9.1       Adds support for ocaml-secondary-compiler to ocamlfind
zarith                   1.12        Implements arithmetic and logical operations over arbitrary-precision integers
[NOTE] Package coq is already installed (current version is dev).
The following actions will be performed:
  - install coq-extructures 0.1.0
<><> Gathering sources ><><><><><><><><><><><><><><><><><><><><><><><><><><><><>
Processing  1/1: [coq-extructures.0.1.0: http]
[coq-extructures.0.1.0] downloaded from https://github.com/arthuraa/extructures/archive/v0.1.0.tar.gz
Processing  1/1:
<><> Processing actions <><><><><><><><><><><><><><><><><><><><><><><><><><><><>
Processing  1/2: [coq-extructures: coq_makefile _CoqProject]
+ /home/bench/.opam/opam-init/hooks/sandbox.sh "build" "coq_makefile" "-f" "_CoqProject" "-o" "Makefile" (CWD=/home/bench/.opam/ocaml-base-compiler.4.05.0/.opam-switch/build/coq-extructures.0.1.0)
Processing  1/2: [coq-extructures: make]
+ /home/bench/.opam/opam-init/hooks/sandbox.sh "build" "make" "-j7" (CWD=/home/bench/.opam/ocaml-base-compiler.4.05.0/.opam-switch/build/coq-extructures.0.1.0)
- COQDEP VFILES
- COQC theories/ord.v
- File "./theories/ord.v", line 43, characters 0-33:
- Warning: Declaring a scope implicitly is deprecated; use in advance an
- explicit "Declare Scope ord_scope.". [undeclared-scope,deprecated]
- File "./theories/ord.v", line 76, characters 46-48:
- Error:
- In environment
- T : Type
- cT : type
- xT := let '{| sort := T |} := cT in T : Type
- The term "xT" has type "Type" while it is expected to have type
-  "Equality.sort (EqType cT class)".
- 
- make[1]: *** [Makefile:764: theories/ord.vo] Error 1
- make: *** [Makefile:387: all] Error 2
[ERROR] The compilation of coq-extructures failed at "/home/bench/.opam/opam-init/hooks/sandbox.sh build make -j7".
#=== ERROR while compiling coq-extructures.0.1.0 ==============================#
# context              2.0.1 | linux/x86_64 | ocaml-base-compiler.4.05.0 | file:///home/bench/run/opam-coq-archive/released
# path                 ~/.opam/ocaml-base-compiler.4.05.0/.opam-switch/build/coq-extructures.0.1.0
# command              ~/.opam/opam-init/hooks/sandbox.sh build make -j7
# exit-code            2
# env-file             ~/.opam/log/coq-extructures-5319-e4db2f.env
# output-file          ~/.opam/log/coq-extructures-5319-e4db2f.out
### output ###
# [...]
# explicit "Declare Scope ord_scope.". [undeclared-scope,deprecated]
# File "./theories/ord.v", line 76, characters 46-48:
# Error:
# In environment
# T : Type
# cT : type
# xT := let '{| sort := T |} := cT in T : Type
# The term "xT" has type "Type" while it is expected to have type
#  "Equality.sort (EqType cT class)".
# 
# make[1]: *** [Makefile:764: theories/ord.vo] Error 1
# make: *** [Makefile:387: all] Error 2
<><> Error report <><><><><><><><><><><><><><><><><><><><><><><><><><><><><><><>
+- The following actions failed
| - build coq-extructures 0.1.0
+- 
- No changes have been performed
# Run eval $(opam env) to update the current shell environment
'opam install -y -v coq-extructures.0.1.0 coq.dev' failed.

Installation size

No files were installed.

Uninstall ๐Ÿงน

Command
true
Return code
0
Missing removes
none
Wrong removes
none