ยซ Up

formal-topology dev Error ๐Ÿ”ฅ

๐Ÿ“… (2021-12-16 03:29:46 UTC)

Context

# Packages matching: installed
# Name                   # Installed # Synopsis
base-bigarray            base
base-threads             base
base-unix                base
conf-findutils           1           Virtual package relying on findutils
conf-gmp                 3           Virtual package relying on a GMP lib system installation
coq                      dev         Formal proof management system
dune                     2.9.1       Fast, portable, and opinionated build system
ocaml                    4.05.0      The OCaml compiler (virtual package)
ocaml-base-compiler      4.05.0      Official 4.05.0 release
ocaml-config             1           OCaml Switch Configuration
ocaml-secondary-compiler 4.08.1-1    OCaml 4.08.1 Secondary Switch Compiler
ocamlfind                1.9.1       A library manager for OCaml
ocamlfind-secondary      1.9.1       Adds support for ocaml-secondary-compiler to ocamlfind
zarith                   1.12        Implements arithmetic and logical operations over arbitrary-precision integers
# opam file:
opam-version: "2.0"
authors: [
  "Ben Sherman <sherm@mit.edu>"
]
maintainer: "Ben Sherman <sherm@mit.edu>"
homepage: "https://github.com/bmsherman/topology"
bug-reports: "https://github.com/bmsherman/topology/issues"
license: "MIT"
build: [make "-j%{jobs}%"]
install: [make "install"]
remove: ["rm" "-R" "%{lib}%/coq/user-contrib/Prob"]
depends: [
  "ocaml"
  "coq" {= "dev"}
  "coq-corn"
]
dev-repo: "git+https://github.com/bmsherman/topology.git"
synopsis: "A programming language for topology and probability in Coq."
flags: light-uninstall
url {
  src: "git+https://github.com/bmsherman/topology.git#ci"
}

Lint

Command
true
Return code
0

Dry install ๐Ÿœ๏ธ

Dry install with the current Coq version:

Command
opam install -y --show-action coq-formal-topology.dev coq.dev
Return code
0

Dry install without Coq/switch base, to test if the problem was incompatibility with the current Coq/OCaml version:

Command
true
Return code
0

Install dependencies

Command
opam list; echo; ulimit -Sv 4000000; timeout 4h opam install -y --deps-only coq-formal-topology.dev coq.dev
Return code
0
Duration
1 h 12 m

Install ๐Ÿš€

Command
opam list; echo; ulimit -Sv 16000000; timeout 4h opam install -y coq-formal-topology.dev coq.dev
Return code
7936
Duration
47 s
Output
# Packages matching: installed
# Name                   # Installed # Synopsis
base-bigarray            base
base-threads             base
base-unix                base
conf-findutils           1           Virtual package relying on findutils
conf-gmp                 3           Virtual package relying on a GMP lib system installation
coq                      dev         Formal proof management system
coq-bignums              dev         Bignums, the Coq library of arbitrary large numbers
coq-corn                 dev         Constructive Coq Repository at Nijmegen.
coq-math-classes         dev         A library of abstract interfaces for mathematical structures in Coq.
dune                     2.9.1       Fast, portable, and opinionated build system
ocaml                    4.05.0      The OCaml compiler (virtual package)
ocaml-base-compiler      4.05.0      Official 4.05.0 release
ocaml-config             1           OCaml Switch Configuration
ocaml-secondary-compiler 4.08.1-1    OCaml 4.08.1 Secondary Switch Compiler
ocamlfind                1.9.1       A library manager for OCaml
ocamlfind-secondary      1.9.1       Adds support for ocaml-secondary-compiler to ocamlfind
zarith                   1.12        Implements arithmetic and logical operations over arbitrary-precision integers
[NOTE] Package coq is already installed (current version is dev).
The following actions will be performed:
  - install coq-formal-topology dev
<><> Gathering sources ><><><><><><><><><><><><><><><><><><><><><><><><><><><><>
[coq-formal-topology.dev] synchronised from git+https://github.com/bmsherman/topology.git#ci
<><> Processing actions <><><><><><><><><><><><><><><><><><><><><><><><><><><><>
[ERROR] The compilation of coq-formal-topology failed at "/home/bench/.opam/opam-init/hooks/sandbox.sh build make -j7".
#=== ERROR while compiling coq-formal-topology.dev ============================#
# context              2.0.1 | linux/x86_64 | ocaml-base-compiler.4.05.0 | file:///home/bench/run/opam-coq-archive/extra-dev
# path                 ~/.opam/ocaml-base-compiler.4.05.0/.opam-switch/build/coq-formal-topology.dev
# command              ~/.opam/opam-init/hooks/sandbox.sh build make -j7
# exit-code            2
# env-file             ~/.opam/log/coq-formal-topology-1137-e4db2f.env
# output-file          ~/.opam/log/coq-formal-topology-1137-e4db2f.out
### output ###
# [...]
# make[2]: *** Waiting for unfinished jobs....
# File "./src/Types/Finite.v", line 39, characters 0-27:
# Error: No such goal.
# 
# make[2]: *** [Makefile.coq:763: src/Types/Finite.vo] Error 1
# File "./src/Numbers/QPosFacts.v", line 7, characters 22-26:
# Error: The reference Qpos was not found in the current environment.
# 
# make[2]: *** [Makefile.coq:763: src/Numbers/QPosFacts.vo] Error 1
# make[1]: *** [Makefile.coq:387: all] Error 2
# make[1]: Leaving directory '/home/bench/.opam/ocaml-base-compiler.4.05.0/.opam-switch/build/coq-formal-topology.dev'
# make: *** [Makefile:8: coq] Error 2
<><> Error report <><><><><><><><><><><><><><><><><><><><><><><><><><><><><><><>
+- The following actions failed
| - build coq-formal-topology dev
+- 
- No changes have been performed
# Run eval $(opam env) to update the current shell environment

Installation size

No files were installed.

Uninstall ๐Ÿงน

Command
true
Return code
0
Missing removes
none
Wrong removes
none