ยซ Up

infotheo 0.3.4 Error with dependencies ๐Ÿš’

๐Ÿ“… (2021-12-16 03:29:46 UTC)

Context

# Packages matching: installed
# Name                   # Installed # Synopsis
base-bigarray            base
base-threads             base
base-unix                base
conf-findutils           1           Virtual package relying on findutils
conf-gmp                 3           Virtual package relying on a GMP lib system installation
coq                      dev         Formal proof management system
dune                     2.9.1       Fast, portable, and opinionated build system
ocaml                    4.05.0      The OCaml compiler (virtual package)
ocaml-base-compiler      4.05.0      Official 4.05.0 release
ocaml-config             1           OCaml Switch Configuration
ocaml-secondary-compiler 4.08.1-1    OCaml 4.08.1 Secondary Switch Compiler
ocamlfind                1.9.1       A library manager for OCaml
ocamlfind-secondary      1.9.1       Adds support for ocaml-secondary-compiler to ocamlfind
zarith                   1.12        Implements arithmetic and logical operations over arbitrary-precision integers
# opam file:
opam-version: "2.0"
maintainer: "Reynald Affeldt <reynald.affeldt@aist.go.jp>"
homepage: "https://github.com/affeldt-aist/infotheo"
dev-repo: "git+https://github.com/affeldt-aist/infotheo.git"
bug-reports: "https://github.com/affeldt-aist/infotheo/issues"
license: "LGPL-2.1-or-later"
synopsis: "Discrete probabilities and information theory for Coq"
description: """
Infotheo is a Coq library for reasoning about discrete probabilities,
information theory, and linear error-correcting codes."""
build: [
  [make "-j%{jobs}%" ]
  [make "-C" "extraction" "tests"] {with-test}
]
install: [make "install"]
depends: [
  "coq" { (>= "8.13" & < "8.15~") | (= "dev") }
  "coq-mathcomp-ssreflect" { (>= "1.13.0" & < "1.14~") | (= "dev") }
  "coq-mathcomp-fingroup" { (>= "1.13.0" & < "1.14~") | (= "dev")  }
  "coq-mathcomp-algebra" { (>= "1.13.0" & < "1.14~") | (= "dev")  }
  "coq-mathcomp-solvable" { (>= "1.13.0" & < "1.14~") | (= "dev")  }
  "coq-mathcomp-field" { (>= "1.13.0" & < "1.14~") | (= "dev")  }
  "coq-mathcomp-analysis" { (>= "0.3.11") & (< "0.4~")}
]
tags: [
  "keyword:information theory"
  "keyword:probability"
  "keyword:error-correcting codes"
  "keyword:convexity"
  "logpath:infotheo"
  "date:2021-11-20"
]
authors: [
  "Reynald Affeldt, AIST"
  "Manabu Hagiwara, Chiba U. (previously AIST)"
  "Jonas Senizergues, ENS Cachan (internship at AIST)"
  "Jacques Garrigue, Nagoya U."
  "Kazuhiko Sakaguchi, Tsukuba U."
  "Taku Asai, Nagoya U. (M2)"
  "Takafumi Saikawa, Nagoya U."
  "Naruomi Obata, Titech (M2)"
]
url {
  http: "https://github.com/affeldt-aist/infotheo/archive/0.3.4.tar.gz"
  checksum: "sha512=31e31c8a6304e8fb28dffb11f490ac3b937dfa9bbc9d3d0256216a9a2dd8f052a7d4129af621805dd6a59f8924cd84d2697a96da26d4fc0ee6407a7f34a6fc76"
}

Lint

Command
true
Return code
0

Dry install ๐Ÿœ๏ธ

Dry install with the current Coq version:

Command
opam install -y --show-action coq-infotheo.0.3.4 coq.dev
Return code
0

Dry install without Coq/switch base, to test if the problem was incompatibility with the current Coq/OCaml version:

Command
true
Return code
0

Install dependencies

Command
opam list; echo; ulimit -Sv 4000000; timeout 4h opam install -y --deps-only coq-infotheo.0.3.4 coq.dev
Return code
7936
Duration
52 m 52 s
Output
# Packages matching: installed
# Name                   # Installed # Synopsis
base-bigarray            base
base-threads             base
base-unix                base
conf-findutils           1           Virtual package relying on findutils
conf-gmp                 3           Virtual package relying on a GMP lib system installation
coq                      dev         Formal proof management system
dune                     2.9.1       Fast, portable, and opinionated build system
ocaml                    4.05.0      The OCaml compiler (virtual package)
ocaml-base-compiler      4.05.0      Official 4.05.0 release
ocaml-config             1           OCaml Switch Configuration
ocaml-secondary-compiler 4.08.1-1    OCaml 4.08.1 Secondary Switch Compiler
ocamlfind                1.9.1       A library manager for OCaml
ocamlfind-secondary      1.9.1       Adds support for ocaml-secondary-compiler to ocamlfind
zarith                   1.12        Implements arithmetic and logical operations over arbitrary-precision integers
The following actions will be performed:
  - install sexplib0               v0.14.0
  - install coq-mathcomp-ssreflect dev
  - install ppx_derivers           1.2.1
  - install cppo                   1.6.8
  - install result                 1.5
  - install seq                    0.2.2
  - install conf-perl              1
  - install ocaml-compiler-libs    v0.12.4
  - install stdlib-shims           0.3.0
  - install coq-mathcomp-finmap    dev
  - install coq-mathcomp-fingroup  dev
  - install coq-mathcomp-bigenough dev
  - install re                     1.10.3
  - install camlp5                 7.14
  - install ppxlib                 0.23.0
  - install coq-mathcomp-algebra   dev
  - install ppx_deriving           5.2.1
  - install coq-mathcomp-solvable  dev
  - install elpi                   1.13.8
  - install coq-mathcomp-field     dev
  - install coq-elpi               dev
  - install coq-hierarchy-builder  dev
  - install coq-mathcomp-analysis  0.3.11
===== 23 to install =====
<><> Gathering sources ><><><><><><><><><><><><><><><><><><><><><><><><><><><><>
[camlp5.7.14] downloaded from cache at https://opam.ocaml.org/cache
[coq-hierarchy-builder.dev] synchronised from git+https://github.com/math-comp/hierarchy-builder.git#coq-master
[coq-mathcomp-analysis.0.3.11] downloaded from https://github.com/math-comp/analysis/archive/0.3.11.tar.gz
[coq-elpi.dev] synchronised from git+https://github.com/LPCIC/coq-elpi.git#coq-master
[coq-mathcomp-algebra.dev] synchronised from git+https://github.com/math-comp/math-comp.git
[coq-mathcomp-bigenough.dev] synchronised from git+https://github.com/math-comp/bigenough.git#master
[coq-mathcomp-fingroup.dev] synchronised from git+https://github.com/math-comp/math-comp.git
[coq-mathcomp-field.dev] synchronised from git+https://github.com/math-comp/math-comp.git
[coq-mathcomp-solvable.dev] synchronised from git+https://github.com/math-comp/math-comp.git
[cppo.1.6.8] downloaded from cache at https://opam.ocaml.org/cache
[coq-mathcomp-ssreflect.dev] synchronised from git+https://github.com/math-comp/math-comp.git#master
[elpi.1.13.8] downloaded from cache at https://opam.ocaml.org/cache
[ocaml-compiler-libs.v0.12.4] downloaded from cache at https://opam.ocaml.org/cache
[ppx_derivers.1.2.1] downloaded from cache at https://opam.ocaml.org/cache
[ppx_deriving.5.2.1] downloaded from cache at https://opam.ocaml.org/cache
[ppxlib.0.23.0] downloaded from cache at https://opam.ocaml.org/cache
[re.1.10.3] downloaded from cache at https://opam.ocaml.org/cache
[coq-mathcomp-finmap.dev] synchronised from git+https://github.com/math-comp/finmap.git#master
[result.1.5] downloaded from cache at https://opam.ocaml.org/cache
[seq.0.2.2] downloaded from cache at https://opam.ocaml.org/cache
[sexplib0.v0.14.0] downloaded from cache at https://opam.ocaml.org/cache
[stdlib-shims.0.3.0] downloaded from cache at https://opam.ocaml.org/cache
<><> Processing actions <><><><><><><><><><><><><><><><><><><><><><><><><><><><>
-> installed conf-perl.1
-> installed cppo.1.6.8
-> installed ocaml-compiler-libs.v0.12.4
-> installed ppx_derivers.1.2.1
-> installed result.1.5
-> installed seq.0.2.2
-> installed sexplib0.v0.14.0
-> installed stdlib-shims.0.3.0
-> installed re.1.10.3
-> installed ppxlib.0.23.0
-> installed ppx_deriving.5.2.1
-> installed coq-mathcomp-ssreflect.dev
-> installed coq-mathcomp-bigenough.dev
-> installed camlp5.7.14
-> installed elpi.1.13.8
-> installed coq-mathcomp-finmap.dev
[ERROR] The compilation of coq-elpi failed at "/home/bench/.opam/opam-init/hooks/sandbox.sh build make COQBIN=/home/bench/.opam/ocaml-base-compiler.4.05.0/bin/ ELPIDIR=/home/bench/.opam/ocaml-base-compiler.4.05.0/lib/elpi OCAMLWARN=".
-> installed coq-mathcomp-fingroup.dev
-> installed coq-mathcomp-algebra.dev
-> installed coq-mathcomp-solvable.dev
-> installed coq-mathcomp-field.dev
#=== ERROR while compiling coq-elpi.dev =======================================#
# context              2.0.1 | linux/x86_64 | ocaml-base-compiler.4.05.0 | file:///home/bench/run/opam-coq-archive/extra-dev
# path                 ~/.opam/ocaml-base-compiler.4.05.0/.opam-switch/build/coq-elpi.dev
# command              ~/.opam/opam-init/hooks/sandbox.sh build make COQBIN=/home/bench/.opam/ocaml-base-compiler.4.05.0/bin/ ELPIDIR=/home/bench/.opam/ocaml-base-compiler.4.05.0/lib/elpi OCAMLWARN=
# exit-code            2
# env-file             ~/.opam/log/coq-elpi-24564-312949.env
# output-file          ~/.opam/log/coq-elpi-24564-312949.out
### output ###
# [...]
# CAMLC -c src/coq_elpi_vernacular.mli
# CAMLC -c src/coq_elpi_glob_quotation.mli
# CAMLC -c src/coq_elpi_arg_syntax.ml
# CAMLC -c src/coq_elpi_vernacular_syntax.ml
# CAMLC -c src/coq_elpi_config.ml
# CAMLC -c src/coq_elpi_builtins.mli
# CAMLC -c src/coq_elpi_vernacular.ml
# File "src/coq_elpi_vernacular.ml", line 713, characters 56-64:
# Error: Unbound value tclFAILn
# Hint: Did you mean tclFAIL?
# make[1]: *** [Makefile.coq:707: src/coq_elpi_vernacular.cmo] Error 2
# make: *** [Makefile:30: build] Error 2
<><> Error report <><><><><><><><><><><><><><><><><><><><><><><><><><><><><><><>
+- The following actions failed
| - build coq-elpi dev
+- 
+- The following changes have been performed (the rest was aborted)
| - install camlp5                 7.14
| - install conf-perl              1
| - install coq-mathcomp-algebra   dev
| - install coq-mathcomp-bigenough dev
| - install coq-mathcomp-field     dev
| - install coq-mathcomp-fingroup  dev
| - install coq-mathcomp-finmap    dev
| - install coq-mathcomp-solvable  dev
| - install coq-mathcomp-ssreflect dev
| - install cppo                   1.6.8
| - install elpi                   1.13.8
| - install ocaml-compiler-libs    v0.12.4
| - install ppx_derivers           1.2.1
| - install ppx_deriving           5.2.1
| - install ppxlib                 0.23.0
| - install re                     1.10.3
| - install result                 1.5
| - install seq                    0.2.2
| - install sexplib0               v0.14.0
| - install stdlib-shims           0.3.0
+- 
# Run eval $(opam env) to update the current shell environment
The former state can be restored with:
    opam switch import "/home/bench/.opam/ocaml-base-compiler.4.05.0/.opam-switch/backup/state-20211213041441.export"

Install ๐Ÿš€

Command
true
Return code
0
Duration
0 s

Installation size

No files were installed.

Uninstall ๐Ÿงน

Command
true
Return code
0
Missing removes
none
Wrong removes
none