ยซ Up

iris 3.1.0 Error with dependencies ๐Ÿš’

๐Ÿ“… (2021-12-16 03:29:46 UTC)

Context

# Packages matching: installed
# Name                   # Installed # Synopsis
base-bigarray            base
base-threads             base
base-unix                base
conf-findutils           1           Virtual package relying on findutils
conf-gmp                 3           Virtual package relying on a GMP lib system installation
coq                      dev         Formal proof management system
dune                     2.9.1       Fast, portable, and opinionated build system
ocaml                    4.05.0      The OCaml compiler (virtual package)
ocaml-base-compiler      4.05.0      Official 4.05.0 release
ocaml-config             1           OCaml Switch Configuration
ocaml-secondary-compiler 4.08.1-1    OCaml 4.08.1 Secondary Switch Compiler
ocamlfind                1.9.1       A library manager for OCaml
ocamlfind-secondary      1.9.1       Adds support for ocaml-secondary-compiler to ocamlfind
zarith                   1.12        Implements arithmetic and logical operations over arbitrary-precision integers
# opam file:
opam-version: "2.0"
name: "coq-iris"
maintainer: "Ralf Jung <jung@mpi-sws.org>"
authors: "The Iris Team"
homepage: "http://iris-project.org/"
bug-reports: "https://gitlab.mpi-sws.org/FP/iris-coq/issues"
license: "BSD"
dev-repo: "git+https://gitlab.mpi-sws.org/FP/iris-coq.git"
build: [make "-j%{jobs}%"]
install: [make "install"]
remove: ["rm" "-rf" "%{lib}%/coq/user-contrib/iris"]
depends: [
  "ocaml"
  "coq" {(>= "8.6.1" & < "8.9~") | (= "dev")}
  "coq-mathcomp-ssreflect" {(>= "1.6.1" & < "1.8~") | (= "dev")}
  "coq-stdpp" {(= "1.1.0") | (= "dev")}
]
synopsis: "This is the Coq development of the Iris Project"
flags: light-uninstall
url {
  src:
    "https://gitlab.mpi-sws.org/iris/iris/-/archive/iris-3.1.0.tar.gz"
  checksum: "md5=3e280893c0189141bb681cc87b7a9401"
}

Lint

Command
true
Return code
0

Dry install ๐Ÿœ๏ธ

Dry install with the current Coq version:

Command
opam install -y --show-action coq-iris.3.1.0 coq.dev
Return code
0

Dry install without Coq/switch base, to test if the problem was incompatibility with the current Coq/OCaml version:

Command
true
Return code
0

Install dependencies

Command
opam list; echo; ulimit -Sv 4000000; timeout 4h opam install -y --deps-only coq-iris.3.1.0 coq.dev
Return code
7936
Duration
4 m 50 s
Output
# Packages matching: installed
# Name                   # Installed # Synopsis
base-bigarray            base
base-threads             base
base-unix                base
conf-findutils           1           Virtual package relying on findutils
conf-gmp                 3           Virtual package relying on a GMP lib system installation
coq                      dev         Formal proof management system
dune                     2.9.1       Fast, portable, and opinionated build system
ocaml                    4.05.0      The OCaml compiler (virtual package)
ocaml-base-compiler      4.05.0      Official 4.05.0 release
ocaml-config             1           OCaml Switch Configuration
ocaml-secondary-compiler 4.08.1-1    OCaml 4.08.1 Secondary Switch Compiler
ocamlfind                1.9.1       A library manager for OCaml
ocamlfind-secondary      1.9.1       Adds support for ocaml-secondary-compiler to ocamlfind
zarith                   1.12        Implements arithmetic and logical operations over arbitrary-precision integers
The following actions will be performed:
  - install coq-mathcomp-ssreflect dev
  - install coq-stdpp              1.1.0
===== 2 to install =====
<><> Gathering sources ><><><><><><><><><><><><><><><><><><><><><><><><><><><><>
[coq-stdpp.1.1.0] downloaded from https://gitlab.mpi-sws.org/iris/stdpp/-/archive/coq-stdpp-1.1.0.tar.gz
[coq-mathcomp-ssreflect.dev] synchronised from git+https://github.com/math-comp/math-comp.git#master
<><> Processing actions <><><><><><><><><><><><><><><><><><><><><><><><><><><><>
[ERROR] The compilation of coq-stdpp failed at "/home/bench/.opam/opam-init/hooks/sandbox.sh build make -j7".
-> installed coq-mathcomp-ssreflect.dev
#=== ERROR while compiling coq-stdpp.1.1.0 ====================================#
# context              2.0.1 | linux/x86_64 | ocaml-base-compiler.4.05.0 | file:///home/bench/run/opam-coq-archive/released
# path                 ~/.opam/ocaml-base-compiler.4.05.0/.opam-switch/build/coq-stdpp.1.1.0
# command              ~/.opam/opam-init/hooks/sandbox.sh build make -j7
# exit-code            2
# env-file             ~/.opam/log/coq-stdpp-4764-03b1a4.env
# output-file          ~/.opam/log/coq-stdpp-4764-03b1a4.out
### output ###
# [...]
# release. For the time being, adding instances outside of sections without
# specifying an explicit locality attribute is therefore deprecated. It is
# recommended to use "export" whenever possible. Use the attributes #[local],
# #[global] and #[export] depending on your choice. For example: "#[export]
# Instance Foo : Bar := baz." [deprecated-instance-without-locality,deprecated]
# File "./theories/base.v", line 126, characters 20-21:
# Error: The reference A was not found in the current environment.
# 
# make[2]: *** [Makefile.coq:770: theories/base.vo] Error 1
# make[1]: *** [Makefile.coq:387: all] Error 2
# make[1]: Leaving directory '/home/bench/.opam/ocaml-base-compiler.4.05.0/.opam-switch/build/coq-stdpp.1.1.0'
# make: *** [Makefile:6: all] Error 2
<><> Error report <><><><><><><><><><><><><><><><><><><><><><><><><><><><><><><>
+- The following actions failed
| - build coq-stdpp 1.1.0
+- 
+- The following changes have been performed
| - install coq-mathcomp-ssreflect dev
+- 
# Run eval $(opam env) to update the current shell environment
The former state can be restored with:
    opam switch import "/home/bench/.opam/ocaml-base-compiler.4.05.0/.opam-switch/backup/state-20211214131417.export"

Install ๐Ÿš€

Command
true
Return code
0
Duration
0 s

Installation size

No files were installed.

Uninstall ๐Ÿงน

Command
true
Return code
0
Missing removes
none
Wrong removes
none