ยซ Up

iris 3.2.0 Error with dependencies ๐Ÿš’

๐Ÿ“… (2021-12-16 03:29:46 UTC)

Context

# Packages matching: installed
# Name                   # Installed # Synopsis
base-bigarray            base
base-threads             base
base-unix                base
conf-findutils           1           Virtual package relying on findutils
conf-gmp                 3           Virtual package relying on a GMP lib system installation
coq                      dev         Formal proof management system
dune                     2.9.1       Fast, portable, and opinionated build system
ocaml                    4.05.0      The OCaml compiler (virtual package)
ocaml-base-compiler      4.05.0      Official 4.05.0 release
ocaml-config             1           OCaml Switch Configuration
ocaml-secondary-compiler 4.08.1-1    OCaml 4.08.1 Secondary Switch Compiler
ocamlfind                1.9.1       A library manager for OCaml
ocamlfind-secondary      1.9.1       Adds support for ocaml-secondary-compiler to ocamlfind
zarith                   1.12        Implements arithmetic and logical operations over arbitrary-precision integers
# opam file:
opam-version: "2.0"
name: "coq-iris"
maintainer: "Ralf Jung <jung@mpi-sws.org>"
authors: "The Iris Team"
homepage: "https://iris-project.org/"
bug-reports: "https://gitlab.mpi-sws.org/FP/iris-coq/issues"
license: "BSD"
dev-repo: "git+https://gitlab.mpi-sws.org/FP/iris-coq.git"
tags: [ "date:2019-08-29" ]
synopsis: "Iris is a Higher-Order Concurrent Separation Logic Framework with support for interactive proofs"
depends: [
  "coq" { (= "8.7.2") | (= "8.8.2") | (>= "8.9" & < "8.11~") | (= "dev") }
  "coq-stdpp" { (= "1.2.1") | (= "dev") }
]
build: [make "-j%{jobs}%"]
install: [make "install"]
url {
  src:
    "https://gitlab.mpi-sws.org/iris/iris/-/archive/iris-3.2.0.tar.gz"
  checksum:
    "sha512=2b83cefb84382ad6a1b66a252ca3b8a69595228d841988638c12474d68a405b919dc8413d42d5edaef64f1f8f909a95568c78ae9fc3a7723a65f1ae07513d90f"
}

Lint

Command
true
Return code
0

Dry install ๐Ÿœ๏ธ

Dry install with the current Coq version:

Command
opam install -y --show-action coq-iris.3.2.0 coq.dev
Return code
0

Dry install without Coq/switch base, to test if the problem was incompatibility with the current Coq/OCaml version:

Command
true
Return code
0

Install dependencies

Command
opam list; echo; ulimit -Sv 4000000; timeout 4h opam install -y --deps-only coq-iris.3.2.0 coq.dev
Return code
7936
Duration
16 s
Output
# Packages matching: installed
# Name                   # Installed # Synopsis
base-bigarray            base
base-threads             base
base-unix                base
conf-findutils           1           Virtual package relying on findutils
conf-gmp                 3           Virtual package relying on a GMP lib system installation
coq                      dev         Formal proof management system
dune                     2.9.1       Fast, portable, and opinionated build system
ocaml                    4.05.0      The OCaml compiler (virtual package)
ocaml-base-compiler      4.05.0      Official 4.05.0 release
ocaml-config             1           OCaml Switch Configuration
ocaml-secondary-compiler 4.08.1-1    OCaml 4.08.1 Secondary Switch Compiler
ocamlfind                1.9.1       A library manager for OCaml
ocamlfind-secondary      1.9.1       Adds support for ocaml-secondary-compiler to ocamlfind
zarith                   1.12        Implements arithmetic and logical operations over arbitrary-precision integers
The following actions will be performed:
  - install coq-stdpp 1.2.1
<><> Gathering sources ><><><><><><><><><><><><><><><><><><><><><><><><><><><><>
[coq-stdpp.1.2.1] downloaded from https://gitlab.mpi-sws.org/iris/stdpp/-/archive/coq-stdpp-1.2.1.tar.gz
<><> Processing actions <><><><><><><><><><><><><><><><><><><><><><><><><><><><>
[ERROR] The compilation of coq-stdpp failed at "/home/bench/.opam/opam-init/hooks/sandbox.sh build make -j7".
#=== ERROR while compiling coq-stdpp.1.2.1 ====================================#
# context              2.0.1 | linux/x86_64 | ocaml-base-compiler.4.05.0 | file:///home/bench/run/opam-coq-archive/released
# path                 ~/.opam/ocaml-base-compiler.4.05.0/.opam-switch/build/coq-stdpp.1.2.1
# command              ~/.opam/opam-init/hooks/sandbox.sh build make -j7
# exit-code            2
# env-file             ~/.opam/log/coq-stdpp-14860-335865.env
# output-file          ~/.opam/log/coq-stdpp-14860-335865.out
### output ###
# [...]
# release. For the time being, adding instances outside of sections without
# specifying an explicit locality attribute is therefore deprecated. It is
# recommended to use "export" whenever possible. Use the attributes #[local],
# #[global] and #[export] depending on your choice. For example: "#[export]
# Instance Foo : Bar := baz." [deprecated-instance-without-locality,deprecated]
# File "./theories/base.v", line 448, characters 25-26:
# Error: The reference A was not found in the current environment.
# 
# make[2]: *** [Makefile.coq:764: theories/base.vo] Error 1
# make[1]: *** [Makefile.coq:387: all] Error 2
# make[1]: Leaving directory '/home/bench/.opam/ocaml-base-compiler.4.05.0/.opam-switch/build/coq-stdpp.1.2.1'
# make: *** [Makefile:6: all] Error 2
<><> Error report <><><><><><><><><><><><><><><><><><><><><><><><><><><><><><><>
+- The following actions failed
| - build coq-stdpp 1.2.1
+- 
- No changes have been performed
# Run eval $(opam env) to update the current shell environment

Install ๐Ÿš€

Command
true
Return code
0
Duration
0 s

Installation size

No files were installed.

Uninstall ๐Ÿงน

Command
true
Return code
0
Missing removes
none
Wrong removes
none