ยซ Up

iris 3.4.0 Error with dependencies ๐Ÿš’

๐Ÿ“… (2021-12-16 03:29:46 UTC)

Context

# Packages matching: installed
# Name                   # Installed # Synopsis
base-bigarray            base
base-threads             base
base-unix                base
conf-findutils           1           Virtual package relying on findutils
conf-gmp                 3           Virtual package relying on a GMP lib system installation
coq                      dev         Formal proof management system
dune                     2.9.1       Fast, portable, and opinionated build system
ocaml                    4.05.0      The OCaml compiler (virtual package)
ocaml-base-compiler      4.05.0      Official 4.05.0 release
ocaml-config             1           OCaml Switch Configuration
ocaml-secondary-compiler 4.08.1-1    OCaml 4.08.1 Secondary Switch Compiler
ocamlfind                1.9.1       A library manager for OCaml
ocamlfind-secondary      1.9.1       Adds support for ocaml-secondary-compiler to ocamlfind
zarith                   1.12        Implements arithmetic and logical operations over arbitrary-precision integers
# opam file:
opam-version: "2.0"
maintainer: "Ralf Jung <jung@mpi-sws.org>"
authors: "The Iris Team"
license: "BSD-3-Clause"
homepage: "https://iris-project.org/"
bug-reports: "https://gitlab.mpi-sws.org/iris/iris/issues"
dev-repo: "git+https://gitlab.mpi-sws.org/iris/iris.git"
synopsis: "Iris is a Higher-Order Concurrent Separation Logic Framework with support for interactive proofs"
description: """
This package provides the following Coq modules:
iris.prelude, iris.algebra, iris.si_logic, iris.bi, iris.proofmode, iris.base_logic, iris.program_logic.
"""
tags: [
  "date:2021-02-16"
]
depends: [
  "coq" { (>= "8.11" & < "8.14~") | (= "dev") }
  "coq-stdpp" { (= "1.5.0") | (= "dev") }
]
build: ["./make-package" "iris" "-j%{jobs}%"]
install: ["./make-package" "iris" "install"]
url {
  src:
    "https://gitlab.mpi-sws.org/iris/iris/-/archive/iris-3.4.0.tar.gz"
  checksum:
    "sha512=f227cf2535e76315605c0dce8adeb9c0ef157a6f97e99624915331061d88ab1892dc0342fe5de1591b234fcd767496572d3bfc70bdb11ac49909bd7d403d2af9"
}

Lint

Command
true
Return code
0

Dry install ๐Ÿœ๏ธ

Dry install with the current Coq version:

Command
opam install -y --show-action coq-iris.3.4.0 coq.dev
Return code
0

Dry install without Coq/switch base, to test if the problem was incompatibility with the current Coq/OCaml version:

Command
true
Return code
0

Install dependencies

Command
opam list; echo; ulimit -Sv 4000000; timeout 4h opam install -y --deps-only coq-iris.3.4.0 coq.dev
Return code
7936
Duration
54 s
Output
# Packages matching: installed
# Name                   # Installed # Synopsis
base-bigarray            base
base-threads             base
base-unix                base
conf-findutils           1           Virtual package relying on findutils
conf-gmp                 3           Virtual package relying on a GMP lib system installation
coq                      dev         Formal proof management system
dune                     2.9.1       Fast, portable, and opinionated build system
ocaml                    4.05.0      The OCaml compiler (virtual package)
ocaml-base-compiler      4.05.0      Official 4.05.0 release
ocaml-config             1           OCaml Switch Configuration
ocaml-secondary-compiler 4.08.1-1    OCaml 4.08.1 Secondary Switch Compiler
ocamlfind                1.9.1       A library manager for OCaml
ocamlfind-secondary      1.9.1       Adds support for ocaml-secondary-compiler to ocamlfind
zarith                   1.12        Implements arithmetic and logical operations over arbitrary-precision integers
The following actions will be performed:
  - install coq-stdpp 1.5.0
<><> Gathering sources ><><><><><><><><><><><><><><><><><><><><><><><><><><><><>
[coq-stdpp.1.5.0] downloaded from https://gitlab.mpi-sws.org/iris/stdpp/-/archive/coq-stdpp-1.5.0.tar.gz
<><> Processing actions <><><><><><><><><><><><><><><><><><><><><><><><><><><><>
[ERROR] The compilation of coq-stdpp failed at "/home/bench/.opam/opam-init/hooks/sandbox.sh build make -j7".
#=== ERROR while compiling coq-stdpp.1.5.0 ====================================#
# context              2.0.1 | linux/x86_64 | ocaml-base-compiler.4.05.0 | file:///home/bench/run/opam-coq-archive/released
# path                 ~/.opam/ocaml-base-compiler.4.05.0/.opam-switch/build/coq-stdpp.1.5.0
# command              ~/.opam/opam-init/hooks/sandbox.sh build make -j7
# exit-code            2
# env-file             ~/.opam/log/coq-stdpp-6736-8b8a2d.env
# output-file          ~/.opam/log/coq-stdpp-6736-8b8a2d.out
### output ###
# [...]
# File "./theories/option.v", line 152, characters 0-32:
# Warning: The default value for Typeclasses Opaque and Typeclasses Transparent
# locality is currently "local" in a section and "global" otherwise, but is
# scheduled to change in a future release. For the time being, adding typeclass
# transparency hints outside of sections without specifying an explicit
# locality attribute is therefore deprecated. It is recommended to use "export"
# whenever possible. Use the attributes #[local], #[global] and #[export]
# depending on your choice. For example: "#[export] Typeclasses Transparent
# foo." [deprecated-typeclasses-transparency-without-locality,deprecated]
# make[1]: *** [Makefile.coq:387: all] Error 2
# make[1]: Leaving directory '/home/bench/.opam/ocaml-base-compiler.4.05.0/.opam-switch/build/coq-stdpp.1.5.0'
# make: *** [Makefile:3: all] Error 2
<><> Error report <><><><><><><><><><><><><><><><><><><><><><><><><><><><><><><>
+- The following actions failed
| - build coq-stdpp 1.5.0
+- 
- No changes have been performed
# Run eval $(opam env) to update the current shell environment

Install ๐Ÿš€

Command
true
Return code
0
Duration
0 s

Installation size

No files were installed.

Uninstall ๐Ÿงน

Command
true
Return code
0
Missing removes
none
Wrong removes
none