ยซ Up

iris 3.5.0 Error with dependencies ๐Ÿš’

๐Ÿ“… (2021-12-16 03:29:46 UTC)

Context

# Packages matching: installed
# Name                   # Installed # Synopsis
base-bigarray            base
base-threads             base
base-unix                base
conf-findutils           1           Virtual package relying on findutils
conf-gmp                 3           Virtual package relying on a GMP lib system installation
coq                      dev         Formal proof management system
dune                     2.9.1       Fast, portable, and opinionated build system
ocaml                    4.05.0      The OCaml compiler (virtual package)
ocaml-base-compiler      4.05.0      Official 4.05.0 release
ocaml-config             1           OCaml Switch Configuration
ocaml-secondary-compiler 4.08.1-1    OCaml 4.08.1 Secondary Switch Compiler
ocamlfind                1.9.1       A library manager for OCaml
ocamlfind-secondary      1.9.1       Adds support for ocaml-secondary-compiler to ocamlfind
zarith                   1.12        Implements arithmetic and logical operations over arbitrary-precision integers
# opam file:
opam-version: "2.0"
maintainer: "Ralf Jung <jung@mpi-sws.org>"
authors: "The Iris Team"
license: "BSD-3-Clause"
homepage: "https://iris-project.org/"
bug-reports: "https://gitlab.mpi-sws.org/iris/iris/issues"
dev-repo: "git+https://gitlab.mpi-sws.org/iris/iris.git"
synopsis: "A Higher-Order Concurrent Separation Logic Framework with support for interactive proofs"
description: """
Iris is a framework for reasoning about the safety of concurrent programs using
concurrent separation logic. It can be used to develop a program logic, for
defining logical relations, and for reasoning about type systems, among other
applications. This package includes the base logic, Iris Proof Mode (IPM) /
MoSeL, and a general language-independent program logic; see coq-iris-heap-lang
for an instantiation of the program logic to a particular programming language.
"""
tags: [
  "date:2021-11-05"
  "logpath:iris.prelude"
  "logpath:iris.algebra"
  "logpath:iris.si_logic"
  "logpath:iris.bi"
  "logpath:iris.proofmode"
  "logpath:iris.base_logic"
  "logpath:iris.program_logic"
]
depends: [
  "coq" { (>= "8.12" & < "8.15~") | (= "dev") }
  "coq-stdpp" { (= "1.6.0") | (= "dev") }
]
build: ["./make-package" "iris" "-j%{jobs}%"]
install: ["./make-package" "iris" "install"]
url {
  src:
    "https://gitlab.mpi-sws.org/iris/iris/-/archive/iris-3.5.0.tar.gz"
  checksum:
    "sha512=a9b7485d020e31863f33dd50d4bdafdc7584c56647126b868aff5546453f10a61c7b4a8f68dbb35269a1888083f72066c5dd50480afa5a2bf069681464f5b44a"
}

Lint

Command
true
Return code
0

Dry install ๐Ÿœ๏ธ

Dry install with the current Coq version:

Command
opam install -y --show-action coq-iris.3.5.0 coq.dev
Return code
0

Dry install without Coq/switch base, to test if the problem was incompatibility with the current Coq/OCaml version:

Command
true
Return code
0

Install dependencies

Command
opam list; echo; ulimit -Sv 4000000; timeout 4h opam install -y --deps-only coq-iris.3.5.0 coq.dev
Return code
7936
Duration
41 s
Output
# Packages matching: installed
# Name                   # Installed # Synopsis
base-bigarray            base
base-threads             base
base-unix                base
conf-findutils           1           Virtual package relying on findutils
conf-gmp                 3           Virtual package relying on a GMP lib system installation
coq                      dev         Formal proof management system
dune                     2.9.1       Fast, portable, and opinionated build system
ocaml                    4.05.0      The OCaml compiler (virtual package)
ocaml-base-compiler      4.05.0      Official 4.05.0 release
ocaml-config             1           OCaml Switch Configuration
ocaml-secondary-compiler 4.08.1-1    OCaml 4.08.1 Secondary Switch Compiler
ocamlfind                1.9.1       A library manager for OCaml
ocamlfind-secondary      1.9.1       Adds support for ocaml-secondary-compiler to ocamlfind
zarith                   1.12        Implements arithmetic and logical operations over arbitrary-precision integers
The following actions will be performed:
  - install coq-stdpp 1.6.0
<><> Gathering sources ><><><><><><><><><><><><><><><><><><><><><><><><><><><><>
[coq-stdpp.1.6.0] downloaded from https://gitlab.mpi-sws.org/iris/stdpp/-/archive/coq-stdpp-1.6.0.tar.gz
<><> Processing actions <><><><><><><><><><><><><><><><><><><><><><><><><><><><>
[ERROR] The compilation of coq-stdpp failed at "/home/bench/.opam/opam-init/hooks/sandbox.sh build make -j7".
#=== ERROR while compiling coq-stdpp.1.6.0 ====================================#
# context              2.0.1 | linux/x86_64 | ocaml-base-compiler.4.05.0 | file:///home/bench/run/opam-coq-archive/released
# path                 ~/.opam/ocaml-base-compiler.4.05.0/.opam-switch/build/coq-stdpp.1.6.0
# command              ~/.opam/opam-init/hooks/sandbox.sh build make -j7
# exit-code            2
# env-file             ~/.opam/log/coq-stdpp-10045-8b8a2d.env
# output-file          ~/.opam/log/coq-stdpp-10045-8b8a2d.out
### output ###
# [...]
# [deprecated-syntactic-definition,deprecated]
# File "./theories/numbers.v", line 1353, characters 13-23:
# Warning: Notation plus_assoc is deprecated since 8.16.
# The Arith.Plus file is obsolete. Use Nat.add_assoc instead.
# [deprecated-syntactic-definition,deprecated]
# File "./theories/numbers.v", line 1353, characters 13-23:
# Warning: Notation plus_assoc is deprecated since 8.16.
# The Arith.Plus file is obsolete. Use Nat.add_assoc instead.
# [deprecated-syntactic-definition,deprecated]
# make[1]: *** [Makefile.coq:387: all] Error 2
# make[1]: Leaving directory '/home/bench/.opam/ocaml-base-compiler.4.05.0/.opam-switch/build/coq-stdpp.1.6.0'
# make: *** [Makefile:3: all] Error 2
<><> Error report <><><><><><><><><><><><><><><><><><><><><><><><><><><><><><><>
+- The following actions failed
| - build coq-stdpp 1.6.0
+- 
- No changes have been performed
# Run eval $(opam env) to update the current shell environment

Install ๐Ÿš€

Command
true
Return code
0
Duration
0 s

Installation size

No files were installed.

Uninstall ๐Ÿงน

Command
true
Return code
0
Missing removes
none
Wrong removes
none