ยซ Up

mathcomp-analysis dev Error with dependencies ๐Ÿš’

๐Ÿ“… (2021-12-16 03:29:46 UTC)

Context

# Packages matching: installed
# Name                   # Installed # Synopsis
base-bigarray            base
base-threads             base
base-unix                base
conf-findutils           1           Virtual package relying on findutils
conf-gmp                 3           Virtual package relying on a GMP lib system installation
coq                      dev         Formal proof management system
dune                     2.9.1       Fast, portable, and opinionated build system
ocaml                    4.05.0      The OCaml compiler (virtual package)
ocaml-base-compiler      4.05.0      Official 4.05.0 release
ocaml-config             1           OCaml Switch Configuration
ocaml-secondary-compiler 4.08.1-1    OCaml 4.08.1 Secondary Switch Compiler
ocamlfind                1.9.1       A library manager for OCaml
ocamlfind-secondary      1.9.1       Adds support for ocaml-secondary-compiler to ocamlfind
zarith                   1.12        Implements arithmetic and logical operations over arbitrary-precision integers
# opam file:
opam-version: "2.0"
maintainer: "pierre-yves@strub.nu"
homepage: "https://github.com/math-comp/analysis"
bug-reports: "https://github.com/math-comp/analysis/issues"
dev-repo: "git+https://github.com/math-comp/analysis.git"
license: "CECILL-C"
authors: [
  "Reynald Affeldt"
  "Cyril Cohen"
  "Assia Mahboubi"
  "Damien Rouhling"
  "Pierre-Yves Strub"
]
build: [
  [make "INSTMODE=global" "config"]
  [make "-j%{jobs}%"]
]
install: [
  [make "install"]
]
remove: ["rm" "-R" "%{lib}%/coq/user-contrib/mathcomp/analysis"]
depends: [
  "coq" { (>= "8.11" & < "8.14~") | (= "dev") }
  "coq-mathcomp-ssreflect" { (>= "1.12.0" & < "1.13~") | (= "dev") }
  "coq-mathcomp-fingroup"
  "coq-mathcomp-algebra"
  "coq-mathcomp-solvable"
  "coq-mathcomp-field"
  "coq-mathcomp-finmap" { (>= "1.5.1" & < "1.6~") | (= "dev") }
  "coq-hierarchy-builder" { >= "0.10.0" | (= "dev") }
]
synopsis: "An analysis library for mathematical components"
description: """
This repository contains an experimental library for real analysis for
the Coq proof-assistant and using the Mathematical Components library.
It is inspired by the Coquelicot library.
"""
url {
  src: "git+https://github.com/math-comp/analysis.git#master"
}

Lint

Command
true
Return code
0

Dry install ๐Ÿœ๏ธ

Dry install with the current Coq version:

Command
opam install -y --show-action coq-mathcomp-analysis.dev coq.dev
Return code
0

Dry install without Coq/switch base, to test if the problem was incompatibility with the current Coq/OCaml version:

Command
true
Return code
0

Install dependencies

Command
opam list; echo; ulimit -Sv 4000000; timeout 4h opam install -y --deps-only coq-mathcomp-analysis.dev coq.dev
Return code
7936
Duration
34 m 20 s
Output
# Packages matching: installed
# Name                   # Installed # Synopsis
base-bigarray            base
base-threads             base
base-unix                base
conf-findutils           1           Virtual package relying on findutils
conf-gmp                 3           Virtual package relying on a GMP lib system installation
coq                      dev         Formal proof management system
dune                     2.9.1       Fast, portable, and opinionated build system
ocaml                    4.05.0      The OCaml compiler (virtual package)
ocaml-base-compiler      4.05.0      Official 4.05.0 release
ocaml-config             1           OCaml Switch Configuration
ocaml-secondary-compiler 4.08.1-1    OCaml 4.08.1 Secondary Switch Compiler
ocamlfind                1.9.1       A library manager for OCaml
ocamlfind-secondary      1.9.1       Adds support for ocaml-secondary-compiler to ocamlfind
zarith                   1.12        Implements arithmetic and logical operations over arbitrary-precision integers
The following actions will be performed:
  - install sexplib0               v0.14.0
  - install coq-mathcomp-ssreflect dev
  - install ppx_derivers           1.2.1
  - install cppo                   1.6.8
  - install result                 1.5
  - install seq                    0.2.2
  - install conf-perl              1
  - install ocaml-compiler-libs    v0.12.4
  - install stdlib-shims           0.3.0
  - install coq-mathcomp-finmap    dev
  - install coq-mathcomp-fingroup  dev
  - install re                     1.10.3
  - install camlp5                 7.14
  - install ppxlib                 0.23.0
  - install coq-mathcomp-algebra   dev
  - install ppx_deriving           5.2.1
  - install coq-mathcomp-solvable  dev
  - install elpi                   1.13.8
  - install coq-mathcomp-field     dev
  - install coq-elpi               dev
  - install coq-hierarchy-builder  dev
===== 21 to install =====
<><> Gathering sources ><><><><><><><><><><><><><><><><><><><><><><><><><><><><>
[camlp5.7.14] downloaded from cache at https://opam.ocaml.org/cache
[coq-hierarchy-builder.dev] synchronised from git+https://github.com/math-comp/hierarchy-builder.git#coq-master
[coq-elpi.dev] synchronised from git+https://github.com/LPCIC/coq-elpi.git#coq-master
[coq-mathcomp-algebra.dev] synchronised from git+https://github.com/math-comp/math-comp.git
[coq-mathcomp-field.dev] synchronised from git+https://github.com/math-comp/math-comp.git
[coq-mathcomp-fingroup.dev] synchronised from git+https://github.com/math-comp/math-comp.git
[coq-mathcomp-finmap.dev] synchronised from git+https://github.com/math-comp/finmap.git#master
[cppo.1.6.8] downloaded from cache at https://opam.ocaml.org/cache
[coq-mathcomp-ssreflect.dev] synchronised from git+https://github.com/math-comp/math-comp.git#master
[coq-mathcomp-solvable.dev] synchronised from git+https://github.com/math-comp/math-comp.git
[elpi.1.13.8] downloaded from cache at https://opam.ocaml.org/cache
[ocaml-compiler-libs.v0.12.4] downloaded from cache at https://opam.ocaml.org/cache
[ppx_derivers.1.2.1] downloaded from cache at https://opam.ocaml.org/cache
[ppx_deriving.5.2.1] downloaded from cache at https://opam.ocaml.org/cache
[ppxlib.0.23.0] downloaded from cache at https://opam.ocaml.org/cache
[re.1.10.3] downloaded from cache at https://opam.ocaml.org/cache
[result.1.5] downloaded from cache at https://opam.ocaml.org/cache
[seq.0.2.2] downloaded from cache at https://opam.ocaml.org/cache
[sexplib0.v0.14.0] downloaded from cache at https://opam.ocaml.org/cache
[stdlib-shims.0.3.0] downloaded from cache at https://opam.ocaml.org/cache
<><> Processing actions <><><><><><><><><><><><><><><><><><><><><><><><><><><><>
-> installed conf-perl.1
-> installed cppo.1.6.8
-> installed ocaml-compiler-libs.v0.12.4
-> installed ppx_derivers.1.2.1
-> installed result.1.5
-> installed seq.0.2.2
-> installed sexplib0.v0.14.0
-> installed stdlib-shims.0.3.0
-> installed re.1.10.3
-> installed ppxlib.0.23.0
-> installed ppx_deriving.5.2.1
-> installed coq-mathcomp-ssreflect.dev
-> installed camlp5.7.14
-> installed elpi.1.13.8
-> installed coq-mathcomp-finmap.dev
[ERROR] The compilation of coq-elpi failed at "/home/bench/.opam/opam-init/hooks/sandbox.sh build make COQBIN=/home/bench/.opam/ocaml-base-compiler.4.05.0/bin/ ELPIDIR=/home/bench/.opam/ocaml-base-compiler.4.05.0/lib/elpi OCAMLWARN=".
-> installed coq-mathcomp-fingroup.dev
-> installed coq-mathcomp-algebra.dev
-> installed coq-mathcomp-solvable.dev
-> installed coq-mathcomp-field.dev
#=== ERROR while compiling coq-elpi.dev =======================================#
# context              2.0.1 | linux/x86_64 | ocaml-base-compiler.4.05.0 | file:///home/bench/run/opam-coq-archive/extra-dev
# path                 ~/.opam/ocaml-base-compiler.4.05.0/.opam-switch/build/coq-elpi.dev
# command              ~/.opam/opam-init/hooks/sandbox.sh build make COQBIN=/home/bench/.opam/ocaml-base-compiler.4.05.0/bin/ ELPIDIR=/home/bench/.opam/ocaml-base-compiler.4.05.0/lib/elpi OCAMLWARN=
# exit-code            2
# env-file             ~/.opam/log/coq-elpi-7991-a96a4f.env
# output-file          ~/.opam/log/coq-elpi-7991-a96a4f.out
### output ###
# [...]
# CAMLC -c src/coq_elpi_vernacular.mli
# CAMLC -c src/coq_elpi_glob_quotation.mli
# CAMLC -c src/coq_elpi_arg_syntax.ml
# CAMLC -c src/coq_elpi_vernacular_syntax.ml
# CAMLC -c src/coq_elpi_config.ml
# CAMLC -c src/coq_elpi_builtins.mli
# CAMLC -c src/coq_elpi_vernacular.ml
# File "src/coq_elpi_vernacular.ml", line 713, characters 56-64:
# Error: Unbound value tclFAILn
# Hint: Did you mean tclFAIL?
# make[1]: *** [Makefile.coq:707: src/coq_elpi_vernacular.cmo] Error 2
# make: *** [Makefile:30: build] Error 2
<><> Error report <><><><><><><><><><><><><><><><><><><><><><><><><><><><><><><>
+- The following actions failed
| - build coq-elpi dev
+- 
+- The following changes have been performed (the rest was aborted)
| - install camlp5                 7.14
| - install conf-perl              1
| - install coq-mathcomp-algebra   dev
| - install coq-mathcomp-field     dev
| - install coq-mathcomp-fingroup  dev
| - install coq-mathcomp-finmap    dev
| - install coq-mathcomp-solvable  dev
| - install coq-mathcomp-ssreflect dev
| - install cppo                   1.6.8
| - install elpi                   1.13.8
| - install ocaml-compiler-libs    v0.12.4
| - install ppx_derivers           1.2.1
| - install ppx_deriving           5.2.1
| - install ppxlib                 0.23.0
| - install re                     1.10.3
| - install result                 1.5
| - install seq                    0.2.2
| - install sexplib0               v0.14.0
| - install stdlib-shims           0.3.0
+- 
# Run eval $(opam env) to update the current shell environment
The former state can be restored with:
    opam switch import "/home/bench/.opam/ocaml-base-compiler.4.05.0/.opam-switch/backup/state-20211213073127.export"

Install ๐Ÿš€

Command
true
Return code
0
Duration
0 s

Installation size

No files were installed.

Uninstall ๐Ÿงน

Command
true
Return code
0
Missing removes
none
Wrong removes
none