« Up

param-pi dev Error 🔥

📅 (2021-12-16 03:29:46 UTC)

Context

# Packages matching: installed
# Name                   # Installed # Synopsis
base-bigarray            base
base-threads             base
base-unix                base
conf-findutils           1           Virtual package relying on findutils
conf-gmp                 3           Virtual package relying on a GMP lib system installation
coq                      dev         Formal proof management system
dune                     2.9.1       Fast, portable, and opinionated build system
ocaml                    4.05.0      The OCaml compiler (virtual package)
ocaml-base-compiler      4.05.0      Official 4.05.0 release
ocaml-config             1           OCaml Switch Configuration
ocaml-secondary-compiler 4.08.1-1    OCaml 4.08.1 Secondary Switch Compiler
ocamlfind                1.9.1       A library manager for OCaml
ocamlfind-secondary      1.9.1       Adds support for ocaml-secondary-compiler to ocamlfind
zarith                   1.12        Implements arithmetic and logical operations over arbitrary-precision integers
# opam file:
opam-version: "2.0"
maintainer: "dev@clarus.me"
homepage: "https://github.com/coq-contribs/param-pi"
license: "LGPL 2"
build: [
  ["coq_makefile" "-f" "Make" "-o" "Makefile"]
  [make "-j%{jobs}%"]
]
install: [make "install"]
remove: ["rm" "-R" "%{lib}%/coq/user-contrib/ParamPi"]
depends: [
  "ocaml"
  "coq" {= "dev"}
]
tags: [
  "keyword:pi-calculus"
  "category:Computer Science/Lambda Calculi"
  "date:1998-09-30"
]
authors: [ "Loïc Henry-Gréard <lhenrygr@cma.inria.fr>" ]
synopsis: "Coding of a typed monadic pi-calculus using parameters for free names"
description: """
This development contains the specification for a monadic
pi-calculus using the same coding method for names than
J. Mc Kinna and R. Pollack used for PTS in LEGO:
"Some Lambda Calculus and Type Theory Formalized".
The basic, monadic calculus encoded here has a type system
restraining the direction of communication for processes' names.
A number of lemmas usefull for doing proofs on that coding
are included, and subject reduction properties for each kind
of transition is made as an example of actually using the
coding to mechanize proofs on the pi-calculus."""
flags: light-uninstall
url {
  src: "git+https://github.com/coq-contribs/param-pi.git#master"
}

Lint

Command
true
Return code
0

Dry install 🏜️

Dry install with the current Coq version:

Command
opam install -y --show-action coq-param-pi.dev coq.dev
Return code
0

Dry install without Coq/switch base, to test if the problem was incompatibility with the current Coq/OCaml version:

Command
true
Return code
0

Install dependencies

Command
opam list; echo; ulimit -Sv 4000000; timeout 4h opam install -y --deps-only coq-param-pi.dev coq.dev
Return code
0
Duration
11 s

Install 🚀

Command
opam list; echo; ulimit -Sv 16000000; timeout 4h opam install -y coq-param-pi.dev coq.dev
Return code
7936
Duration
28 s
Output
# Packages matching: installed
# Name                   # Installed # Synopsis
base-bigarray            base
base-threads             base
base-unix                base
conf-findutils           1           Virtual package relying on findutils
conf-gmp                 3           Virtual package relying on a GMP lib system installation
coq                      dev         Formal proof management system
dune                     2.9.1       Fast, portable, and opinionated build system
ocaml                    4.05.0      The OCaml compiler (virtual package)
ocaml-base-compiler      4.05.0      Official 4.05.0 release
ocaml-config             1           OCaml Switch Configuration
ocaml-secondary-compiler 4.08.1-1    OCaml 4.08.1 Secondary Switch Compiler
ocamlfind                1.9.1       A library manager for OCaml
ocamlfind-secondary      1.9.1       Adds support for ocaml-secondary-compiler to ocamlfind
zarith                   1.12        Implements arithmetic and logical operations over arbitrary-precision integers
[NOTE] Package coq is already installed (current version is dev).
The following actions will be performed:
  - install coq-param-pi dev
<><> Gathering sources ><><><><><><><><><><><><><><><><><><><><><><><><><><><><>
[coq-param-pi.dev] synchronised from git+https://github.com/coq-contribs/param-pi.git#master
<><> Processing actions <><><><><><><><><><><><><><><><><><><><><><><><><><><><>
[ERROR] The compilation of coq-param-pi failed at "/home/bench/.opam/opam-init/hooks/sandbox.sh build make -j7".
#=== ERROR while compiling coq-param-pi.dev ===================================#
# context              2.0.1 | linux/x86_64 | ocaml-base-compiler.4.05.0 | file:///home/bench/run/opam-coq-archive/extra-dev
# path                 ~/.opam/ocaml-base-compiler.4.05.0/.opam-switch/build/coq-param-pi.dev
# command              ~/.opam/opam-init/hooks/sandbox.sh build make -j7
# exit-code            2
# env-file             ~/.opam/log/coq-param-pi-15023-865888.env
# output-file          ~/.opam/log/coq-param-pi-15023-865888.out
### output ###
# [...]
# COQC fresh.v
# COQC typing_proofs.v
# COQC substitutions.v
# File "./typing_proofs.v", line 20, characters 0-45:
# Warning: There is no flag or option with this name:
# "Standard Proposition Elimination Names". [unknown-option,option]
# File "./typing_proofs.v", line 224, characters 6-36:
# Error: No such bound variable p0 (possible names are: q, D, p and t).
# 
# make[1]: *** [Makefile:764: typing_proofs.vo] Error 1
# make[1]: *** Waiting for unfinished jobs....
# make: *** [Makefile:387: all] Error 2
<><> Error report <><><><><><><><><><><><><><><><><><><><><><><><><><><><><><><>
+- The following actions failed
| - build coq-param-pi dev
+- 
- No changes have been performed
# Run eval $(opam env) to update the current shell environment

Installation size

No files were installed.

Uninstall 🧹

Command
true
Return code
0
Missing removes
none
Wrong removes
none