« Up

paramcoq dev Error 🔥

📅 (2021-12-16 03:29:46 UTC)

Context

# Packages matching: installed
# Name                   # Installed # Synopsis
base-bigarray            base
base-threads             base
base-unix                base
conf-findutils           1           Virtual package relying on findutils
conf-gmp                 3           Virtual package relying on a GMP lib system installation
coq                      dev         Formal proof management system
dune                     2.9.1       Fast, portable, and opinionated build system
ocaml                    4.05.0      The OCaml compiler (virtual package)
ocaml-base-compiler      4.05.0      Official 4.05.0 release
ocaml-config             1           OCaml Switch Configuration
ocaml-secondary-compiler 4.08.1-1    OCaml 4.08.1 Secondary Switch Compiler
ocamlfind                1.9.1       A library manager for OCaml
ocamlfind-secondary      1.9.1       Adds support for ocaml-secondary-compiler to ocamlfind
zarith                   1.12        Implements arithmetic and logical operations over arbitrary-precision integers
# opam file:
opam-version: "2.0"
name: "coq-paramcoq"
version: "dev"
maintainer: "Pierre Roux <pierre.roux@onera.fr>"
homepage: "https://github.com/coq-community/paramcoq"
bug-reports: "https://github.com/coq-community/paramcoq/issues"
dev-repo: "git+https://github.com/coq-community/paramcoq.git"
license: "MIT"
build: [make "-j%{jobs}%"]
install: [make "install"]
remove: ["rm" "-R" "%{lib}%/coq/user-contrib/Param"]
depends: [
  "coq" {= "dev"}
]
tags: [
  "keyword:paramcoq"
  "keyword:parametricity"
  "keyword:OCaml modules"
  "category:Miscellaneous/Coq Extensions"
  "logpath:Param"
]
authors: [
  "Chantal Keller (Inria, École polytechnique)"
  "Marc Lasson (ÉNS de Lyon)"
  "Abhishek Anand"
  "Pierre Roux"
  "Emilio Jesús Gallego Arias"
  "Cyril Cohen"
  "Matthieu Sozeau"
]
synopsis: "Paramcoq"
description: """
The plugin is still in an experimental state. It is not very user
friendly (lack of good error messages) and still contains bugs. But is
useable enough to "translate" a large chunk of standard library."""
url {
  src: "git+https://github.com/coq-community/paramcoq.git"
}

Lint

Command
true
Return code
0

Dry install 🏜️

Dry install with the current Coq version:

Command
opam install -y --show-action coq-paramcoq.dev coq.dev
Return code
0

Dry install without Coq/switch base, to test if the problem was incompatibility with the current Coq/OCaml version:

Command
true
Return code
0

Install dependencies

Command
opam list; echo; ulimit -Sv 4000000; timeout 4h opam install -y --deps-only coq-paramcoq.dev coq.dev
Return code
0
Duration
25 s

Install 🚀

Command
opam list; echo; ulimit -Sv 16000000; timeout 4h opam install -y coq-paramcoq.dev coq.dev
Return code
7936
Duration
41 s
Output
# Packages matching: installed
# Name                   # Installed # Synopsis
base-bigarray            base
base-threads             base
base-unix                base
conf-findutils           1           Virtual package relying on findutils
conf-gmp                 3           Virtual package relying on a GMP lib system installation
coq                      dev         Formal proof management system
dune                     2.9.1       Fast, portable, and opinionated build system
ocaml                    4.05.0      The OCaml compiler (virtual package)
ocaml-base-compiler      4.05.0      Official 4.05.0 release
ocaml-config             1           OCaml Switch Configuration
ocaml-secondary-compiler 4.08.1-1    OCaml 4.08.1 Secondary Switch Compiler
ocamlfind                1.9.1       A library manager for OCaml
ocamlfind-secondary      1.9.1       Adds support for ocaml-secondary-compiler to ocamlfind
zarith                   1.12        Implements arithmetic and logical operations over arbitrary-precision integers
[NOTE] Package coq is already installed (current version is dev).
The following actions will be performed:
  - install coq-paramcoq dev
<><> Gathering sources ><><><><><><><><><><><><><><><><><><><><><><><><><><><><>
[coq-paramcoq.dev] synchronised from git+https://github.com/coq-community/paramcoq.git
<><> Processing actions <><><><><><><><><><><><><><><><><><><><><><><><><><><><>
[ERROR] The compilation of coq-paramcoq failed at "/home/bench/.opam/opam-init/hooks/sandbox.sh build make -j7".
#=== ERROR while compiling coq-paramcoq.dev ===================================#
# context              2.0.1 | linux/x86_64 | ocaml-base-compiler.4.05.0 | file:///home/bench/run/opam-coq-archive/extra-dev
# path                 ~/.opam/ocaml-base-compiler.4.05.0/.opam-switch/build/coq-paramcoq.dev
# command              ~/.opam/opam-init/hooks/sandbox.sh build make -j7
# exit-code            2
# env-file             ~/.opam/log/coq-paramcoq-7523-6cc03f.env
# output-file          ~/.opam/log/coq-paramcoq-7523-6cc03f.out
### output ###
# [...]
# CAMLOPT -c -for-pack Paramcoq src/relations.ml
# File "src/relations.ml", line 51, characters 36-50:
# Error: This expression has type int * GMap.key * 'a -> unit
#        but an expression was expected of type
#          Libobject.object_name * 'b -> unit
#        Type int * GMap.key * 'a is not compatible with type
#          Libobject.object_name * 'b 
# make[2]: *** [Makefile.coq:712: src/relations.cmx] Error 2
# make[2]: *** Waiting for unfinished jobs....
# make[1]: *** [Makefile.coq:387: all] Error 2
# make[1]: Leaving directory '/home/bench/.opam/ocaml-base-compiler.4.05.0/.opam-switch/build/coq-paramcoq.dev'
# make: *** [Makefile:2: all] Error 2
<><> Error report <><><><><><><><><><><><><><><><><><><><><><><><><><><><><><><>
+- The following actions failed
| - build coq-paramcoq dev
+- 
- No changes have been performed
# Run eval $(opam env) to update the current shell environment

Installation size

No files were installed.

Uninstall 🧹

Command
true
Return code
0
Missing removes
none
Wrong removes
none