ยซ Up

unicoq dev Error ๐Ÿ”ฅ

๐Ÿ“… (2021-12-16 03:29:46 UTC)

Context

# Packages matching: installed
# Name                   # Installed # Synopsis
base-bigarray            base
base-threads             base
base-unix                base
conf-findutils           1           Virtual package relying on findutils
conf-gmp                 3           Virtual package relying on a GMP lib system installation
coq                      dev         Formal proof management system
dune                     2.9.1       Fast, portable, and opinionated build system
ocaml                    4.05.0      The OCaml compiler (virtual package)
ocaml-base-compiler      4.05.0      Official 4.05.0 release
ocaml-config             1           OCaml Switch Configuration
ocaml-secondary-compiler 4.08.1-1    OCaml 4.08.1 Secondary Switch Compiler
ocamlfind                1.9.1       A library manager for OCaml
ocamlfind-secondary      1.9.1       Adds support for ocaml-secondary-compiler to ocamlfind
zarith                   1.12        Implements arithmetic and logical operations over arbitrary-precision integers
# opam file:
opam-version: "2.0"
maintainer: "matthieu.sozeau@inria.fr"
authors: [ "Matthieu Sozeau <matthieu.sozeau@inria.fr>" "Beta Ziliani <beta@mpi-sws.org>" ]
dev-repo: "git+https://github.com/unicoq/unicoq.git"
homepage: "https://github.com/unicoq/unicoq"
bug-reports: "https://github.com/unicoq/unicoq/issues"
license: "MIT"
build: [
  ["coq_makefile" "-f" "_CoqProject" "-o" "Makefile"]
  [make "-j%{jobs}%"]
]
install: [
  [make "install"]
]
depends: [
  "ocaml"
  "coq" {>= "8.14"}
]
synopsis: "An enhanced unification algorithm for Coq"
tags: [
  "logpath:Unicoq"
]
url {
  src: "git+https://github.com/unicoq/unicoq.git#master"
}

Lint

Command
true
Return code
0

Dry install ๐Ÿœ๏ธ

Dry install with the current Coq version:

Command
opam install -y --show-action coq-unicoq.dev coq.dev
Return code
0

Dry install without Coq/switch base, to test if the problem was incompatibility with the current Coq/OCaml version:

Command
true
Return code
0

Install dependencies

Command
opam list; echo; ulimit -Sv 4000000; timeout 4h opam install -y --deps-only coq-unicoq.dev coq.dev
Return code
0
Duration
24 s

Install ๐Ÿš€

Command
opam list; echo; ulimit -Sv 16000000; timeout 4h opam install -y coq-unicoq.dev coq.dev
Return code
7936
Duration
58 s
Output
# Packages matching: installed
# Name                   # Installed # Synopsis
base-bigarray            base
base-threads             base
base-unix                base
conf-findutils           1           Virtual package relying on findutils
conf-gmp                 3           Virtual package relying on a GMP lib system installation
coq                      dev         Formal proof management system
dune                     2.9.1       Fast, portable, and opinionated build system
ocaml                    4.05.0      The OCaml compiler (virtual package)
ocaml-base-compiler      4.05.0      Official 4.05.0 release
ocaml-config             1           OCaml Switch Configuration
ocaml-secondary-compiler 4.08.1-1    OCaml 4.08.1 Secondary Switch Compiler
ocamlfind                1.9.1       A library manager for OCaml
ocamlfind-secondary      1.9.1       Adds support for ocaml-secondary-compiler to ocamlfind
zarith                   1.12        Implements arithmetic and logical operations over arbitrary-precision integers
[NOTE] Package coq is already installed (current version is dev).
The following actions will be performed:
  - install coq-unicoq dev
<><> Gathering sources ><><><><><><><><><><><><><><><><><><><><><><><><><><><><>
[coq-unicoq.dev] synchronised from git+https://github.com/unicoq/unicoq.git#master
<><> Processing actions <><><><><><><><><><><><><><><><><><><><><><><><><><><><>
[ERROR] The compilation of coq-unicoq failed at "/home/bench/.opam/opam-init/hooks/sandbox.sh build make -j7".
#=== ERROR while compiling coq-unicoq.dev =====================================#
# context              2.0.1 | linux/x86_64 | ocaml-base-compiler.4.05.0 | file:///home/bench/run/opam-coq-archive/extra-dev
# path                 ~/.opam/ocaml-base-compiler.4.05.0/.opam-switch/build/coq-unicoq.dev
# command              ~/.opam/opam-init/hooks/sandbox.sh build make -j7
# exit-code            2
# env-file             ~/.opam/log/coq-unicoq-4346-865888.env
# output-file          ~/.opam/log/coq-unicoq-4346-865888.out
### output ###
# [...]
# File "src/munify.ml", line 1219, characters 46-66:
# Warning 3: deprecated: Names.eq_constructor
# Use the Construct module
# File "src/munify.ml", line 1224, characters 40-67:
# Warning 3: deprecated: Names.Projection.repr_equal
# Use an explicit projection of Repr
# CAMLOPT -c -for-pack Unicoq src/unitactics.ml
# File "src/unitactics.mlg", line 54, characters 49-74:
# Error: This expression has type Pp.t but an expression was expected of type
#          int
# make[1]: *** [Makefile:712: src/unitactics.cmx] Error 2
# make: *** [Makefile:387: all] Error 2
<><> Error report <><><><><><><><><><><><><><><><><><><><><><><><><><><><><><><>
+- The following actions failed
| - build coq-unicoq dev
+- 
- No changes have been performed
# Run eval $(opam env) to update the current shell environment

Installation size

No files were installed.

Uninstall ๐Ÿงน

Command
true
Return code
0
Missing removes
none
Wrong removes
none