ยซ Up

amm11262 dev Error ๐Ÿ”ฅ

๐Ÿ“… (2022-05-24 01:37:32 UTC)

Context

# Packages matching: installed
# Name              # Installed # Synopsis
base-bigarray       base
base-threads        base
base-unix           base
conf-findutils      1           Virtual package relying on findutils
conf-gmp            4           Virtual package relying on a GMP lib system installation
coq                 dev         Formal proof management system
dune                3.1.1       Fast, portable, and opinionated build system
ocaml               4.10.2      The OCaml compiler (virtual package)
ocaml-base-compiler 4.10.2      Official release 4.10.2
ocaml-config        1           OCaml Switch Configuration
ocamlfind           1.9.3       A library manager for OCaml
zarith              1.12        Implements arithmetic and logical operations over arbitrary-precision integers
# opam file:
opam-version: "2.0"
maintainer: "dev@clarus.me"
homepage: "https://github.com/coq-contribs/amm11262"
license: "LGPL"
build: [
  ["coq_makefile" "-f" "Make" "-o" "Makefile"]
  [make "-j%{jobs}%"]
]
install: [make "install"]
remove: ["rm" "-R" "%{lib}%/coq/user-contrib/AMM11262"]
depends: [
  "ocaml"
  "coq" {= "dev"}
]
tags: [ "keyword:american mathematical monthly problem 11262" "date:2007-04" ]
authors: [ "Tonny Hurkens (paper proof) <hurkens@sci.kun.nl>" "Milad Niqui (Coq files) <milad@cs.ru.nl>" ]
synopsis: "Problem 11262 of The American Mathematical Monthly."
description: """
Formalisation of Tonny Hurkens' proof of the problem
11262 of The American Mathematical Monthly 113(10), Dec. 2006
(see the README files)"""
flags: light-uninstall
url {
  src: "git+https://github.com/coq-contribs/amm11262.git#master"
}

Lint

Command
true
Return code
0

Dry install ๐Ÿœ๏ธ

Dry install with the current Coq version:

Command
opam install -y --show-action coq-amm11262.dev coq.dev
Return code
0

Dry install without Coq/switch base, to test if the problem was incompatibility with the current Coq/OCaml version:

Command
true
Return code
0

Install dependencies

Command
opam list; echo; ulimit -Sv 4000000; timeout 4h opam install -y --deps-only coq-amm11262.dev coq.dev
Return code
0
Duration
12 s

Install ๐Ÿš€

Command
opam list; echo; ulimit -Sv 16000000; timeout 4h opam install -y coq-amm11262.dev coq.dev
Return code
7936
Duration
37 s
Output
# Packages matching: installed
# Name              # Installed # Synopsis
base-bigarray       base
base-threads        base
base-unix           base
conf-findutils      1           Virtual package relying on findutils
conf-gmp            4           Virtual package relying on a GMP lib system installation
coq                 dev         Formal proof management system
dune                3.1.1       Fast, portable, and opinionated build system
ocaml               4.10.2      The OCaml compiler (virtual package)
ocaml-base-compiler 4.10.2      Official release 4.10.2
ocaml-config        1           OCaml Switch Configuration
ocamlfind           1.9.3       A library manager for OCaml
zarith              1.12        Implements arithmetic and logical operations over arbitrary-precision integers
[NOTE] Package coq is already installed (current version is dev).
The following actions will be performed:
  - install coq-amm11262 dev
<><> Gathering sources ><><><><><><><><><><><><><><><><><><><><><><><><><><><><>
[coq-amm11262.dev] synchronised from git+https://github.com/coq-contribs/amm11262.git#master
<><> Processing actions <><><><><><><><><><><><><><><><><><><><><><><><><><><><>
[ERROR] The compilation of coq-amm11262 failed at "/home/bench/.opam/opam-init/hooks/sandbox.sh build make -j4".
#=== ERROR while compiling coq-amm11262.dev ===================================#
# context              2.0.6 | linux/x86_64 | ocaml-base-compiler.4.10.2 | file:///home/bench/run/opam-coq-archive/extra-dev
# path                 ~/.opam/ocaml-base-compiler.4.10.2/.opam-switch/build/coq-amm11262.dev
# command              ~/.opam/opam-init/hooks/sandbox.sh build make -j4
# exit-code            2
# env-file             ~/.opam/log/coq-amm11262-24462-0a5907.env
# output-file          ~/.opam/log/coq-amm11262-24462-0a5907.out
### output ###
# [...]
# COQC unicode_format/utf_AMM11262.v
# COQC ascii_format/AMM11262.v
# File "./unicode_format/utf_AMM11262.v", line 9, characters 0-27:
# Error: Cannot find a physical path bound to logical path Omega.
# 
# make[1]: *** [Makefile:791: unicode_format/utf_AMM11262.vo] Error 1
# make[1]: *** Waiting for unfinished jobs....
# File "./ascii_format/AMM11262.v", line 9, characters 0-27:
# Error: Cannot find a physical path bound to logical path Omega.
# 
# make[1]: *** [Makefile:791: ascii_format/AMM11262.vo] Error 1
# make: *** [Makefile:408: all] Error 2
<><> Error report <><><><><><><><><><><><><><><><><><><><><><><><><><><><><><><>
+- The following actions failed
| - build coq-amm11262 dev
+- 
- No changes have been performed
# Run eval $(opam env) to update the current shell environment

Installation size

No files were installed.

Uninstall ๐Ÿงน

Command
true
Return code
0
Missing removes
none
Wrong removes
none