« Up

automata dev Error 🔥

📅 (2022-05-24 01:37:32 UTC)

Context

# Packages matching: installed
# Name              # Installed # Synopsis
base-bigarray       base
base-threads        base
base-unix           base
conf-findutils      1           Virtual package relying on findutils
conf-gmp            4           Virtual package relying on a GMP lib system installation
coq                 dev         Formal proof management system
dune                3.1.1       Fast, portable, and opinionated build system
ocaml               4.10.2      The OCaml compiler (virtual package)
ocaml-base-compiler 4.10.2      Official release 4.10.2
ocaml-config        1           OCaml Switch Configuration
ocamlfind           1.9.3       A library manager for OCaml
zarith              1.12        Implements arithmetic and logical operations over arbitrary-precision integers
# opam file:
opam-version: "2.0"
maintainer: "dev@clarus.me"
homepage: "https://github.com/coq-contribs/automata"
license: "LGPL 2"
build: [
  ["coq_makefile" "-f" "Make" "-o" "Makefile"]
  [make "-j%{jobs}%"]
]
install: [make "install"]
remove: ["rm" "-R" "%{lib}%/coq/user-contrib/Automata"]
depends: [
  "ocaml"
  "coq" {= "dev"}
]
tags: [
  "keyword:formal language theory"
  "keyword:finite automata"
  "keyword:push down automatas"
  "keyword:rational langages"
  "keyword:Kleene"
  "category:Computer Science/Formal Languages Theory and Automata"
  "date:June-July 1993"
]
authors: [ "Jean-Christophe Filliâtre <>" "Judicaël Courant <>" ]
synopsis: "Beginning of formal language theory"
description: """
This library formalises the beginning of formal language theory:
finite automata and rational languages, context-free grammars
and push-down automata."""
flags: light-uninstall
url {
  src: "git+https://github.com/coq-contribs/automata.git#master"
}

Lint

Command
true
Return code
0

Dry install 🏜️

Dry install with the current Coq version:

Command
opam install -y --show-action coq-automata.dev coq.dev
Return code
0

Dry install without Coq/switch base, to test if the problem was incompatibility with the current Coq/OCaml version:

Command
true
Return code
0

Install dependencies

Command
opam list; echo; ulimit -Sv 4000000; timeout 4h opam install -y --deps-only coq-automata.dev coq.dev
Return code
0
Duration
14 s

Install 🚀

Command
opam list; echo; ulimit -Sv 16000000; timeout 4h opam install -y coq-automata.dev coq.dev
Return code
7936
Duration
42 s
Output
# Packages matching: installed
# Name              # Installed # Synopsis
base-bigarray       base
base-threads        base
base-unix           base
conf-findutils      1           Virtual package relying on findutils
conf-gmp            4           Virtual package relying on a GMP lib system installation
coq                 dev         Formal proof management system
dune                3.1.1       Fast, portable, and opinionated build system
ocaml               4.10.2      The OCaml compiler (virtual package)
ocaml-base-compiler 4.10.2      Official release 4.10.2
ocaml-config        1           OCaml Switch Configuration
ocamlfind           1.9.3       A library manager for OCaml
zarith              1.12        Implements arithmetic and logical operations over arbitrary-precision integers
[NOTE] Package coq is already installed (current version is dev).
The following actions will be performed:
  - install coq-automata dev
<><> Gathering sources ><><><><><><><><><><><><><><><><><><><><><><><><><><><><>
[coq-automata.dev] synchronised from git+https://github.com/coq-contribs/automata.git#master
<><> Processing actions <><><><><><><><><><><><><><><><><><><><><><><><><><><><>
[ERROR] The compilation of coq-automata failed at "/home/bench/.opam/opam-init/hooks/sandbox.sh build make -j4".
#=== ERROR while compiling coq-automata.dev ===================================#
# context              2.0.6 | linux/x86_64 | ocaml-base-compiler.4.10.2 | file:///home/bench/run/opam-coq-archive/extra-dev
# path                 ~/.opam/ocaml-base-compiler.4.10.2/.opam-switch/build/coq-automata.dev
# command              ~/.opam/opam-init/hooks/sandbox.sh build make -j4
# exit-code            2
# env-file             ~/.opam/log/coq-automata-31336-0a5907.env
# output-file          ~/.opam/log/coq-automata-31336-0a5907.out
### output ###
# [...]
# Hint Unfold foo : bar." [deprecated-hint-without-locality,deprecated]
# File "./fonctions.v", line 304, characters 0-24:
# Warning: Adding and removing hints in the core database implicitly is
# deprecated. Please specify a hint database.
# [implicit-core-hint-db,deprecated]
# File "./fonctions.v", line 316, characters 8-19:
# Error:
# Syntax error: [ltac_use_default] expected after [tactic] (in [tactic_command]).
# 
# make[1]: *** [Makefile:791: fonctions.vo] Error 1
# make[1]: *** Waiting for unfinished jobs....
# make: *** [Makefile:408: all] Error 2
<><> Error report <><><><><><><><><><><><><><><><><><><><><><><><><><><><><><><>
+- The following actions failed
| - build coq-automata dev
+- 
- No changes have been performed
# Run eval $(opam env) to update the current shell environment

Installation size

No files were installed.

Uninstall 🧹

Command
true
Return code
0
Missing removes
none
Wrong removes
none