ยซ Up

fiat-crypto-legacy-extra dev Error ๐Ÿ”ฅ

๐Ÿ“… (2022-05-24 01:37:32 UTC)

Context

# Packages matching: installed
# Name              # Installed # Synopsis
base-bigarray       base
base-threads        base
base-unix           base
conf-findutils      1           Virtual package relying on findutils
conf-gmp            4           Virtual package relying on a GMP lib system installation
coq                 dev         Formal proof management system
dune                3.1.1       Fast, portable, and opinionated build system
ocaml               4.10.2      The OCaml compiler (virtual package)
ocaml-base-compiler 4.10.2      Official release 4.10.2
ocaml-config        1           OCaml Switch Configuration
ocamlfind           1.9.3       A library manager for OCaml
zarith              1.12        Implements arithmetic and logical operations over arbitrary-precision integers
# opam file:
opam-version: "2.0"
authors: [
  "Andres Erbsen <andreser@mit.edu>"
  "Google Inc."
  "Jade Philipoom <jadep@mit.edu> <jade.philipoom@gmail.com>"
  "Massachusetts Institute of Technology"
]
maintainer: "Jason Gross <jgross@mit.edu>"
homepage: "https://github.com/mit-plv/fiat-crypto"
bug-reports: "https://github.com/mit-plv/fiat-crypto/issues"
license: "MIT"
build: [
  ["git" "submodule" "update" "--init" "--recursive"]
  [make "-j%{jobs}%" "coq" "selected-specific-display" "coqprime-all"]
  [make "-j%{jobs}%" "specific-vo-lt-10gb"]
  [make "specific-vo-lt-20gb"]
]
install: [make "install"]
depends: [
  "ocaml"
  "coq" {>= "8.7~"}
  "coq-bignums"
]
conflict-class: [
  "coq-fiat-crypto"
]
dev-repo: "git+https://github.com/mit-plv/fiat-crypto.git"
synopsis:
  "Cryptographic Primitive Code Generation in Fiat (legacy pipeline + many large examples)."
tags: ["logpath:Crypto"]
url {
  src: "git+https://github.com/mit-plv/fiat-crypto.git#sp2019latest"
}

Lint

Command
true
Return code
0

Dry install ๐Ÿœ๏ธ

Dry install with the current Coq version:

Command
opam install -y --show-action coq-fiat-crypto-legacy-extra.dev coq.dev
Return code
0

Dry install without Coq/switch base, to test if the problem was incompatibility with the current Coq/OCaml version:

Command
true
Return code
0

Install dependencies

Command
opam list; echo; ulimit -Sv 4000000; timeout 4h opam install -y --deps-only coq-fiat-crypto-legacy-extra.dev coq.dev
Return code
0
Duration
2 m 26 s

Install ๐Ÿš€

Command
opam list; echo; ulimit -Sv 16000000; timeout 4h opam install -y coq-fiat-crypto-legacy-extra.dev coq.dev
Return code
7936
Duration
8 m 10 s
Output
# Packages matching: installed
# Name              # Installed # Synopsis
base-bigarray       base
base-threads        base
base-unix           base
conf-findutils      1           Virtual package relying on findutils
conf-gmp            4           Virtual package relying on a GMP lib system installation
coq                 dev         Formal proof management system
coq-bignums         dev         Bignums, the Coq library of arbitrary large numbers
dune                3.1.1       Fast, portable, and opinionated build system
ocaml               4.10.2      The OCaml compiler (virtual package)
ocaml-base-compiler 4.10.2      Official release 4.10.2
ocaml-config        1           OCaml Switch Configuration
ocamlfind           1.9.3       A library manager for OCaml
zarith              1.12        Implements arithmetic and logical operations over arbitrary-precision integers
[NOTE] Package coq is already installed (current version is dev).
The following actions will be performed:
  - install coq-fiat-crypto-legacy-extra dev
<><> Gathering sources ><><><><><><><><><><><><><><><><><><><><><><><><><><><><>
[coq-fiat-crypto-legacy-extra.dev] synchronised from git+https://github.com/mit-plv/fiat-crypto.git#sp2019latest
<><> Processing actions <><><><><><><><><><><><><><><><><><><><><><><><><><><><>
[ERROR] The compilation of coq-fiat-crypto-legacy-extra failed at "/home/bench/.opam/opam-init/hooks/sandbox.sh build make -j4 coq selected-specific-display coqprime-all".
#=== ERROR while compiling coq-fiat-crypto-legacy-extra.dev ===================#
# context              2.0.6 | linux/x86_64 | ocaml-base-compiler.4.10.2 | file:///home/bench/run/opam-coq-archive/extra-dev
# path                 ~/.opam/ocaml-base-compiler.4.10.2/.opam-switch/build/coq-fiat-crypto-legacy-extra.dev
# command              ~/.opam/opam-init/hooks/sandbox.sh build make -j4 coq selected-specific-display coqprime-all
# exit-code            2
# env-file             ~/.opam/log/coq-fiat-crypto-legacy-extra-10551-335865.env
# output-file          ~/.opam/log/coq-fiat-crypto-legacy-extra-10551-335865.out
### output ###
# [...]
# File "./src/Coqprime/elliptic/GZnZ.v", line 215, characters 6-14:
# Warning: Notation le_or_lt is deprecated since 8.16.
# The Arith.Lt file is obsolete. Use Nat.le_gt_cases instead.
# [deprecated-syntactic-definition,deprecated]
# TIMEOUT -m 10000000 COQC src/Util/ListUtil/SetoidList.v
# make[1]: *** [Makefile.coq:408: all] Error 2
# make: *** [Makefile:339: coqprime-all] Error 2
# make: *** Waiting for unfinished jobs....
# File "./src/Util/ListUtil/SetoidList.v", line 30, characters 2-53:
# Warning: Unused introduction pattern: IHys [unused-intro-pattern,tactics]
# File "./src/Util/ListUtil/SetoidList.v", line 30, characters 2-53:
# Warning: Unused introduction pattern: IHys [unused-intro-pattern,tactics]
<><> Error report <><><><><><><><><><><><><><><><><><><><><><><><><><><><><><><>
+- The following actions failed
| - build coq-fiat-crypto-legacy-extra dev
+- 
- No changes have been performed
# Run eval $(opam env) to update the current shell environment

Installation size

No files were installed.

Uninstall ๐Ÿงน

Command
true
Return code
0
Missing removes
none
Wrong removes
none