« Up

fundamental-arithmetics dev Error 🔥

📅 (2022-05-24 01:37:32 UTC)

Context

# Packages matching: installed
# Name              # Installed # Synopsis
base-bigarray       base
base-threads        base
base-unix           base
conf-findutils      1           Virtual package relying on findutils
conf-gmp            4           Virtual package relying on a GMP lib system installation
coq                 dev         Formal proof management system
dune                3.1.1       Fast, portable, and opinionated build system
ocaml               4.10.2      The OCaml compiler (virtual package)
ocaml-base-compiler 4.10.2      Official release 4.10.2
ocaml-config        1           OCaml Switch Configuration
ocamlfind           1.9.3       A library manager for OCaml
zarith              1.12        Implements arithmetic and logical operations over arbitrary-precision integers
# opam file:
opam-version: "2.0"
maintainer: "dev@clarus.me"
homepage: "https://github.com/coq-contribs/fundamental-arithmetics"
license: "LGPL"
build: [
  ["coq_makefile" "-f" "Make" "-o" "Makefile"]
  [make "-j%{jobs}%"]
]
install: [make "install"]
remove: ["rm" "-R" "%{lib}%/coq/user-contrib/FundamentalArithmetics"]
depends: [
  "ocaml"
  "coq" {= "dev"}
]
tags: [ "keyword:arithmetic" "keyword:number theory" "category:Mathematics/Arithmetic and Number Theory/Miscellaneous" "date:2008-02-1" ]
authors: [ "Sébastien Briais <sebastien.briais at ens-lyon.fr>" ]
synopsis: "Fundamental theorems of arithmetic."
flags: light-uninstall
url {
  src:
    "git+https://github.com/coq-contribs/fundamental-arithmetics.git#master"
}

Lint

Command
true
Return code
0

Dry install 🏜️

Dry install with the current Coq version:

Command
opam install -y --show-action coq-fundamental-arithmetics.dev coq.dev
Return code
0

Dry install without Coq/switch base, to test if the problem was incompatibility with the current Coq/OCaml version:

Command
true
Return code
0

Install dependencies

Command
opam list; echo; ulimit -Sv 4000000; timeout 4h opam install -y --deps-only coq-fundamental-arithmetics.dev coq.dev
Return code
0
Duration
10 s

Install 🚀

Command
opam list; echo; ulimit -Sv 16000000; timeout 4h opam install -y coq-fundamental-arithmetics.dev coq.dev
Return code
7936
Duration
25 s
Output
# Packages matching: installed
# Name              # Installed # Synopsis
base-bigarray       base
base-threads        base
base-unix           base
conf-findutils      1           Virtual package relying on findutils
conf-gmp            4           Virtual package relying on a GMP lib system installation
coq                 dev         Formal proof management system
dune                3.1.1       Fast, portable, and opinionated build system
ocaml               4.10.2      The OCaml compiler (virtual package)
ocaml-base-compiler 4.10.2      Official release 4.10.2
ocaml-config        1           OCaml Switch Configuration
ocamlfind           1.9.3       A library manager for OCaml
zarith              1.12        Implements arithmetic and logical operations over arbitrary-precision integers
[NOTE] Package coq is already installed (current version is dev).
The following actions will be performed:
  - install coq-fundamental-arithmetics dev
<><> Gathering sources ><><><><><><><><><><><><><><><><><><><><><><><><><><><><>
[coq-fundamental-arithmetics.dev] synchronised from git+https://github.com/coq-contribs/fundamental-arithmetics.git#master
<><> Processing actions <><><><><><><><><><><><><><><><><><><><><><><><><><><><>
[ERROR] The compilation of coq-fundamental-arithmetics failed at "/home/bench/.opam/opam-init/hooks/sandbox.sh build make -j4".
#=== ERROR while compiling coq-fundamental-arithmetics.dev ====================#
# context              2.0.6 | linux/x86_64 | ocaml-base-compiler.4.10.2 | file:///home/bench/run/opam-coq-archive/extra-dev
# path                 ~/.opam/ocaml-base-compiler.4.10.2/.opam-switch/build/coq-fundamental-arithmetics.dev
# command              ~/.opam/opam-init/hooks/sandbox.sh build make -j4
# exit-code            2
# env-file             ~/.opam/log/coq-fundamental-arithmetics-13894-0a5907.env
# output-file          ~/.opam/log/coq-fundamental-arithmetics-13894-0a5907.out
### output ###
# [...]
# COQC tactics.v
# COQC missing.v
# File "./missing.v", line 21, characters 0-21:
# Error: Cannot find a physical path bound to logical path Omega.
# 
# make[1]: *** [Makefile:791: missing.vo] Error 1
# make[1]: *** Waiting for unfinished jobs....
# File "./tactics.v", line 44, characters 0-21:
# Error: Cannot find a physical path bound to logical path Omega.
# 
# make[1]: *** [Makefile:791: tactics.vo] Error 1
# make: *** [Makefile:408: all] Error 2
<><> Error report <><><><><><><><><><><><><><><><><><><><><><><><><><><><><><><>
+- The following actions failed
| - build coq-fundamental-arithmetics dev
+- 
- No changes have been performed
# Run eval $(opam env) to update the current shell environment

Installation size

No files were installed.

Uninstall 🧹

Command
true
Return code
0
Missing removes
none
Wrong removes
none