ยซ Up

iris-heap-lang 3.5.0 Error with dependencies ๐Ÿš’

๐Ÿ“… (2022-05-24 01:37:32 UTC)

Context

# Packages matching: installed
# Name              # Installed # Synopsis
base-bigarray       base
base-threads        base
base-unix           base
conf-findutils      1           Virtual package relying on findutils
conf-gmp            4           Virtual package relying on a GMP lib system installation
coq                 dev         Formal proof management system
dune                3.1.1       Fast, portable, and opinionated build system
ocaml               4.10.2      The OCaml compiler (virtual package)
ocaml-base-compiler 4.10.2      Official release 4.10.2
ocaml-config        1           OCaml Switch Configuration
ocamlfind           1.9.3       A library manager for OCaml
zarith              1.12        Implements arithmetic and logical operations over arbitrary-precision integers
# opam file:
opam-version: "2.0"
maintainer: "Ralf Jung <jung@mpi-sws.org>"
authors: "The Iris Team"
license: "BSD-3-Clause"
homepage: "https://iris-project.org/"
bug-reports: "https://gitlab.mpi-sws.org/iris/iris/issues"
dev-repo: "git+https://gitlab.mpi-sws.org/iris/iris.git"
synopsis: "The canonical example language for Iris"
description: """
This package defines HeapLang, a concurrent lambda calculus with references, and
uses Iris to build a program logic for HeapLang programs.
"""
tags: [
  "date:2021-11-05"
  "logpath:iris.heap_lang"
]
depends: [
  "coq-iris" {= version}
]
build: ["./make-package" "iris_heap_lang" "-j%{jobs}%"]
install: ["./make-package" "iris_heap_lang" "install"]
url {
  src:
    "https://gitlab.mpi-sws.org/iris/iris/-/archive/iris-3.5.0.tar.gz"
  checksum:
    "sha512=a9b7485d020e31863f33dd50d4bdafdc7584c56647126b868aff5546453f10a61c7b4a8f68dbb35269a1888083f72066c5dd50480afa5a2bf069681464f5b44a"
}

Lint

Command
true
Return code
0

Dry install ๐Ÿœ๏ธ

Dry install with the current Coq version:

Command
opam install -y --show-action coq-iris-heap-lang.3.5.0 coq.dev
Return code
0

Dry install without Coq/switch base, to test if the problem was incompatibility with the current Coq/OCaml version:

Command
true
Return code
0

Install dependencies

Command
opam list; echo; ulimit -Sv 4000000; timeout 4h opam install -y --deps-only coq-iris-heap-lang.3.5.0 coq.dev
Return code
7936
Duration
5 m 36 s
Output
# Packages matching: installed
# Name              # Installed # Synopsis
base-bigarray       base
base-threads        base
base-unix           base
conf-findutils      1           Virtual package relying on findutils
conf-gmp            4           Virtual package relying on a GMP lib system installation
coq                 dev         Formal proof management system
dune                3.1.1       Fast, portable, and opinionated build system
ocaml               4.10.2      The OCaml compiler (virtual package)
ocaml-base-compiler 4.10.2      Official release 4.10.2
ocaml-config        1           OCaml Switch Configuration
ocamlfind           1.9.3       A library manager for OCaml
zarith              1.12        Implements arithmetic and logical operations over arbitrary-precision integers
The following actions will be performed:
  - install coq-stdpp dev
  - install coq-iris  3.5.0
===== 2 to install =====
<><> Gathering sources ><><><><><><><><><><><><><><><><><><><><><><><><><><><><>
[coq-iris.3.5.0] downloaded from https://gitlab.mpi-sws.org/iris/iris/-/archive/iris-3.5.0.tar.gz
[coq-stdpp.dev] synchronised from git+https://gitlab.mpi-sws.org/iris/stdpp.git
<><> Processing actions <><><><><><><><><><><><><><><><><><><><><><><><><><><><>
-> installed coq-stdpp.dev
[ERROR] The compilation of coq-iris failed at "/home/bench/.opam/opam-init/hooks/sandbox.sh build ./make-package iris -j4".
#=== ERROR while compiling coq-iris.3.5.0 =====================================#
# context              2.0.6 | linux/x86_64 | ocaml-base-compiler.4.10.2 | file:///home/bench/run/opam-coq-archive/released
# path                 ~/.opam/ocaml-base-compiler.4.10.2/.opam-switch/build/coq-iris.3.5.0
# command              ~/.opam/opam-init/hooks/sandbox.sh build ./make-package iris -j4
# exit-code            2
# env-file             ~/.opam/log/coq-iris-6183-8c0dd3.env
# output-file          ~/.opam/log/coq-iris-6183-8c0dd3.out
### output ###
# ?Dom : "Dom ?M (gmap K A โ†’ gset K)"
# [...]
# make[1]: *** [Makefile.package.iris:790: iris/algebra/big_op.vo] Error 1
# make[1]: *** Waiting for unfinished jobs....
# File "./iris/algebra/cmra.v", line 809, characters 0-170:
# Warning:
# A coercion will be introduced in future versions when using ':>' in 'Class' declarations. Use '#[global] Existing Instance field.' instead if you don't want the coercion.
# [future-coercion-class-field,records]
# File "./iris/algebra/cmra.v", line 901, characters 0-174:
# Warning:
# A coercion will be introduced in future versions when using ':>' in 'Class' declarations. Use '#[global] Existing Instance field.' instead if you don't want the coercion.
# [future-coercion-class-field,records]
# make: *** [Makefile.package.iris:408: all] Error 2
<><> Error report <><><><><><><><><><><><><><><><><><><><><><><><><><><><><><><>
+- The following actions failed
| - build coq-iris 3.5.0
+- 
+- The following changes have been performed
| - install coq-stdpp dev
+- 
# Run eval $(opam env) to update the current shell environment
The former state can be restored with:
    opam switch import "/home/bench/.opam/ocaml-base-compiler.4.10.2/.opam-switch/backup/state-20220519184313.export"

Install ๐Ÿš€

Command
true
Return code
0
Duration
0 s

Installation size

No files were installed.

Uninstall ๐Ÿงน

Command
true
Return code
0
Missing removes
none
Wrong removes
none