« Up

jordan-curve-theorem dev Error 🔥

📅 (2022-05-24 01:37:32 UTC)

Context

# Packages matching: installed
# Name              # Installed # Synopsis
base-bigarray       base
base-threads        base
base-unix           base
conf-findutils      1           Virtual package relying on findutils
conf-gmp            4           Virtual package relying on a GMP lib system installation
coq                 dev         Formal proof management system
dune                3.1.1       Fast, portable, and opinionated build system
ocaml               4.10.2      The OCaml compiler (virtual package)
ocaml-base-compiler 4.10.2      Official release 4.10.2
ocaml-config        1           OCaml Switch Configuration
ocamlfind           1.9.3       A library manager for OCaml
zarith              1.12        Implements arithmetic and logical operations over arbitrary-precision integers
# opam file:
opam-version: "2.0"
maintainer: "dev@clarus.me"
homepage: "https://github.com/coq-contribs/jordan-curve-theorem"
license: "unknown"
build: [
  ["coq_makefile" "-f" "Make" "-o" "Makefile"]
  [make "-j%{jobs}%"]
  [make "install"]
]
remove: ["rm" "-R" "%{lib}%/coq/user-contrib/JordanCurveTheorem"]
depends: [
  "ocaml"
  "coq" {= "dev"}
]
tags: [
  "keyword:combinatorial hypermaps"
  "keyword:genus"
  "keyword:planarity"
  "keyword:Euler formula"
  "keyword:discrete Jordan curve theorem"
  "category:Mathematics/Geometry/General"
  "date:2008"
]
authors: [ "Jean-François Dufourd <dufourd@lsiit.u-strasbg.fr>" ]
synopsis: "Hypermaps, planarity and discrete Jordan curve theorem"
description:
  "Constructive formalization of the combinatorial hypermaps, characterization of the planarity, genus theorem, Euler formula, ring of faces, discrete Jordan curve theorem"
flags: light-uninstall
url {
  src: "git+https://github.com/coq-contribs/jordan-curve-theorem.git#master"
}

Lint

Command
true
Return code
0

Dry install 🏜️

Dry install with the current Coq version:

Command
opam install -y --show-action coq-jordan-curve-theorem.dev coq.dev
Return code
0

Dry install without Coq/switch base, to test if the problem was incompatibility with the current Coq/OCaml version:

Command
true
Return code
0

Install dependencies

Command
opam list; echo; ulimit -Sv 4000000; timeout 4h opam install -y --deps-only coq-jordan-curve-theorem.dev coq.dev
Return code
0
Duration
38 s

Install 🚀

Command
opam list; echo; ulimit -Sv 16000000; timeout 4h opam install -y coq-jordan-curve-theorem.dev coq.dev
Return code
7936
Duration
1 m 1 s
Output
# Packages matching: installed
# Name              # Installed # Synopsis
base-bigarray       base
base-threads        base
base-unix           base
conf-findutils      1           Virtual package relying on findutils
conf-gmp            4           Virtual package relying on a GMP lib system installation
coq                 dev         Formal proof management system
dune                3.1.1       Fast, portable, and opinionated build system
ocaml               4.10.2      The OCaml compiler (virtual package)
ocaml-base-compiler 4.10.2      Official release 4.10.2
ocaml-config        1           OCaml Switch Configuration
ocamlfind           1.9.3       A library manager for OCaml
zarith              1.12        Implements arithmetic and logical operations over arbitrary-precision integers
[NOTE] Package coq is already installed (current version is dev).
The following actions will be performed:
  - install coq-jordan-curve-theorem dev
<><> Gathering sources ><><><><><><><><><><><><><><><><><><><><><><><><><><><><>
[coq-jordan-curve-theorem.dev] synchronised from git+https://github.com/coq-contribs/jordan-curve-theorem.git#master
<><> Processing actions <><><><><><><><><><><><><><><><><><><><><><><><><><><><>
[ERROR] The compilation of coq-jordan-curve-theorem failed at "/home/bench/.opam/opam-init/hooks/sandbox.sh build make -j4".
#=== ERROR while compiling coq-jordan-curve-theorem.dev =======================#
# context              2.0.6 | linux/x86_64 | ocaml-base-compiler.4.10.2 | file:///home/bench/run/opam-coq-archive/extra-dev
# path                 ~/.opam/ocaml-base-compiler.4.10.2/.opam-switch/build/coq-jordan-curve-theorem.dev
# command              ~/.opam/opam-init/hooks/sandbox.sh build make -j4
# exit-code            2
# env-file             ~/.opam/log/coq-jordan-curve-theorem-26284-0a5907.env
# output-file          ~/.opam/log/coq-jordan-curve-theorem-26284-0a5907.out
### output ###
# COQDEP VFILES
# *** Warning: in file Jordan1.v, library Omega is required and has not been found in the loadpath!
# COQC Jordan1.v
# File "./Jordan1.v", line 24, characters 0-21:
# Error: Cannot find a physical path bound to logical path Omega.
# 
# make[1]: *** [Makefile:791: Jordan1.vo] Error 1
# make: *** [Makefile:408: all] Error 2
<><> Error report <><><><><><><><><><><><><><><><><><><><><><><><><><><><><><><>
+- The following actions failed
| - build coq-jordan-curve-theorem dev
+- 
- No changes have been performed
# Run eval $(opam env) to update the current shell environment

Installation size

No files were installed.

Uninstall 🧹

Command
true
Return code
0
Missing removes
none
Wrong removes
none