ยซ Up

markov dev Error ๐Ÿ”ฅ

๐Ÿ“… (2022-05-24 01:37:32 UTC)

Context

# Packages matching: installed
# Name              # Installed # Synopsis
base-bigarray       base
base-threads        base
base-unix           base
conf-findutils      1           Virtual package relying on findutils
conf-gmp            4           Virtual package relying on a GMP lib system installation
coq                 dev         Formal proof management system
dune                3.1.1       Fast, portable, and opinionated build system
ocaml               4.10.2      The OCaml compiler (virtual package)
ocaml-base-compiler 4.10.2      Official release 4.10.2
ocaml-config        1           OCaml Switch Configuration
ocamlfind           1.9.3       A library manager for OCaml
zarith              1.12        Implements arithmetic and logical operations over arbitrary-precision integers
# opam file:
opam-version: "2.0"
maintainer: "dev@clarus.me"
homepage: "https://github.com/coq-contribs/markov"
license: "GNU Lesser Public License"
build: [
  ["coq_makefile" "-f" "Make" "-o" "Makefile"]
  [make "-j%{jobs}%"]
]
install: [make "install"]
remove: ["rm" "-R" "%{lib}%/coq/user-contrib/Markov"]
depends: [
  "ocaml"
  "coq" {= "dev"}
]
tags: [
  "keyword:probability"
  "keyword:Markov"
  "keyword:Lebesgue integral"
  "keyword:sigma algebras"
  "keyword:measurability"
  "keyword:Borel"
  "category:Mathematics/Real Calculus and Topology"
  "date:2008-01-5"
]
authors: [ "Robert Kam <rkam2001@hotmail.com>" ]
synopsis: "Markov's inequality"
description:
  "A proof of Markov's inequality, restricted to probability spaces, based on the Wikipedia proof. Defines Lebesgue integral and associated concepts such as measurability, measure functions, and sigma algebras. Extended real numbers did not need to be defined because we are working in a probability space with measure 1. Nonconstructive; uses classic, Extensionality_Ensembles, axiomatized real numbers from Coq standard library."
flags: light-uninstall
url {
  src: "git+https://github.com/coq-contribs/markov.git#master"
}

Lint

Command
true
Return code
0

Dry install ๐Ÿœ๏ธ

Dry install with the current Coq version:

Command
opam install -y --show-action coq-markov.dev coq.dev
Return code
0

Dry install without Coq/switch base, to test if the problem was incompatibility with the current Coq/OCaml version:

Command
true
Return code
0

Install dependencies

Command
opam list; echo; ulimit -Sv 4000000; timeout 4h opam install -y --deps-only coq-markov.dev coq.dev
Return code
0
Duration
11 s

Install ๐Ÿš€

Command
opam list; echo; ulimit -Sv 16000000; timeout 4h opam install -y coq-markov.dev coq.dev
Return code
7936
Duration
24 s
Output
# Packages matching: installed
# Name              # Installed # Synopsis
base-bigarray       base
base-threads        base
base-unix           base
conf-findutils      1           Virtual package relying on findutils
conf-gmp            4           Virtual package relying on a GMP lib system installation
coq                 dev         Formal proof management system
dune                3.1.1       Fast, portable, and opinionated build system
ocaml               4.10.2      The OCaml compiler (virtual package)
ocaml-base-compiler 4.10.2      Official release 4.10.2
ocaml-config        1           OCaml Switch Configuration
ocamlfind           1.9.3       A library manager for OCaml
zarith              1.12        Implements arithmetic and logical operations over arbitrary-precision integers
[NOTE] Package coq is already installed (current version is dev).
The following actions will be performed:
  - install coq-markov dev
<><> Gathering sources ><><><><><><><><><><><><><><><><><><><><><><><><><><><><>
[coq-markov.dev] synchronised from git+https://github.com/coq-contribs/markov.git#master
<><> Processing actions <><><><><><><><><><><><><><><><><><><><><><><><><><><><>
[ERROR] The compilation of coq-markov failed at "/home/bench/.opam/opam-init/hooks/sandbox.sh build make -j4".
#=== ERROR while compiling coq-markov.dev =====================================#
# context              2.0.6 | linux/x86_64 | ocaml-base-compiler.4.10.2 | file:///home/bench/run/opam-coq-archive/extra-dev
# path                 ~/.opam/ocaml-base-compiler.4.10.2/.opam-switch/build/coq-markov.dev
# command              ~/.opam/opam-init/hooks/sandbox.sh build make -j4
# exit-code            2
# env-file             ~/.opam/log/coq-markov-31151-0a5907.env
# output-file          ~/.opam/log/coq-markov-31151-0a5907.out
### output ###
# COQDEP VFILES
# COQC markov.v
# File "./markov.v", line 117, characters 27-31:
# Error: Illegal application (Non-functional construction): 
# The expression "H2" of type "C c" cannot be applied to the term
#  "c0" : "?T"
# 
# make[1]: *** [Makefile:791: markov.vo] Error 1
# make: *** [Makefile:408: all] Error 2
<><> Error report <><><><><><><><><><><><><><><><><><><><><><><><><><><><><><><>
+- The following actions failed
| - build coq-markov dev
+- 
- No changes have been performed
# Run eval $(opam env) to update the current shell environment

Installation size

No files were installed.

Uninstall ๐Ÿงน

Command
true
Return code
0
Missing removes
none
Wrong removes
none