« Up

mathcomp-analysis 0.5.0 Error 🔥

📅 (2022-05-24 01:37:32 UTC)

Context

# Packages matching: installed
# Name              # Installed # Synopsis
base-bigarray       base
base-threads        base
base-unix           base
conf-findutils      1           Virtual package relying on findutils
conf-gmp            4           Virtual package relying on a GMP lib system installation
coq                 dev         Formal proof management system
dune                3.1.1       Fast, portable, and opinionated build system
ocaml               4.10.2      The OCaml compiler (virtual package)
ocaml-base-compiler 4.10.2      Official release 4.10.2
ocaml-config        1           OCaml Switch Configuration
ocamlfind           1.9.3       A library manager for OCaml
zarith              1.12        Implements arithmetic and logical operations over arbitrary-precision integers
# opam file:
opam-version: "2.0"
maintainer: "Reynald Affeldt <reynald.affeldt@aist.go.jp>"
homepage: "https://github.com/math-comp/analysis"
dev-repo: "git+https://github.com/math-comp/analysis.git"
bug-reports: "https://github.com/math-comp/analysis/issues"
license: "CECILL-C"
synopsis: "An analysis library for mathematical components"
description: """
This repository contains an experimental library for real analysis for
the Coq proof-assistant and using the Mathematical Components library."""
build: [make "-j%{jobs}%"]
install: [make "install"]
depends: [
  "coq" { (>= "8.13" & < "8.16~") | (= "dev") }
  "coq-mathcomp-ssreflect" { (>= "1.13.0" & < "1.15~") | (= "dev") }
  "coq-mathcomp-fingroup" { (>= "1.13.0" & < "1.15~") | (= "dev") }
  "coq-mathcomp-algebra" { (>= "1.13.0" & < "1.15~") | (= "dev") }
  "coq-mathcomp-solvable" { (>= "1.13.0" & < "1.15~") | (= "dev") }
  "coq-mathcomp-field" { (>= "1.13.0" & < "1.15~") | (= "dev") }
  "coq-mathcomp-finmap" { (>= "1.5.1" & < "1.6~") | (= "dev") }
  "coq-mathcomp-bigenough" { (>= "1.0.0") }
  "coq-hierarchy-builder" { (>= "1.2.0") }
]
tags: [
  "category:Mathematics/Real Calculus and Topology"
  "keyword:analysis"
  "keyword:topology"
  "keyword:real numbers"
  "date:2022-03-23"
  "logpath:mathcomp.analysis"
]
authors: [
  "Reynald Affeldt"
  "Yves Bertot"
  "Cyril Cohen"
  "Marie Kerjean"
  "Assia Mahboubi"
  "Damien Rouhling"
  "Pierre Roux"
  "Kazuhiko Sakaguchi"
  "Zachary Stone"
  "Pierre-Yves Strub"
  "Laurent Théry"
]
url {
  http: "https://github.com/math-comp/analysis/archive/0.5.0.tar.gz"
  checksum: "sha512=57e5ec7e71338de65f1a07a9036c6d19a3584f757be76e8375a2f984d1fd05265928113a57c44d942e0ef9be7753299240763052d60661cb59551f7abb33b1e8"
}

Lint

Command
true
Return code
0

Dry install 🏜️

Dry install with the current Coq version:

Command
opam install -y --show-action coq-mathcomp-analysis.0.5.0 coq.dev
Return code
0

Dry install without Coq/switch base, to test if the problem was incompatibility with the current Coq/OCaml version:

Command
true
Return code
0

Install dependencies

Command
opam list; echo; ulimit -Sv 4000000; timeout 4h opam install -y --deps-only coq-mathcomp-analysis.0.5.0 coq.dev
Return code
0
Duration
38 m 58 s

Install 🚀

Command
opam list; echo; ulimit -Sv 16000000; timeout 4h opam install -y -v coq-mathcomp-analysis.0.5.0 coq.dev
Return code
7936
Duration
30 s
Output
# Packages matching: installed
# Name                 # Installed # Synopsis
base-bigarray          base
base-threads           base
base-unix              base
conf-findutils         1           Virtual package relying on findutils
conf-gmp               4           Virtual package relying on a GMP lib system installation
coq                    dev         Formal proof management system
coq-elpi               dev         Elpi extension language for Coq
coq-hierarchy-builder  dev         High level commands to declare and evolve a hierarchy based on packed classes
coq-mathcomp-algebra   dev         Mathematical Components Library on Algebra
coq-mathcomp-bigenough dev         A small library to do epsilon - N reasonning
coq-mathcomp-field     dev         Mathematical Components Library on Fields
coq-mathcomp-fingroup  dev         Mathematical Components Library on finite groups
coq-mathcomp-finmap    dev         Finite sets, finite maps, finitely supported functions
coq-mathcomp-solvable  dev         Mathematical Components Library on finite groups (II)
coq-mathcomp-ssreflect dev         Small Scale Reflection
cppo                   1.6.8       Code preprocessor like cpp for OCaml
dune                   3.1.1       Fast, portable, and opinionated build system
elpi                   1.15.2      ELPI - Embeddable λProlog Interpreter
menhir                 dev         An LR(1) parser generator
menhirLib              dev         Runtime support library for parsers generated by Menhir
menhirSdk              dev         Compile-time library for auxiliary tools related to Menhir
ocaml                  4.10.2      The OCaml compiler (virtual package)
ocaml-base-compiler    4.10.2      Official release 4.10.2
ocaml-compiler-libs    v0.12.4     OCaml compiler libraries repackaged
ocaml-config           1           OCaml Switch Configuration
ocamlfind              1.9.3       A library manager for OCaml
ppx_derivers           1.2.1       Shared [@@deriving] plugin registry
ppx_deriving           5.2.1       Type-driven code generation for OCaml
ppxlib                 0.26.0      Standard library for ppx rewriters
re                     1.10.4      RE is a regular expression library for OCaml
result                 1.5         Compatibility Result module
seq                    base        Compatibility package for OCaml's standard iterator type starting from 4.07.
sexplib0               v0.15.0     Library containing the definition of S-expressions and some base converters
stdlib-shims           0.3.0       Backport some of the new stdlib features to older compiler
zarith                 1.12        Implements arithmetic and logical operations over arbitrary-precision integers
[NOTE] Package coq is already installed (current version is dev).
The following actions will be performed:
  - install coq-mathcomp-analysis 0.5.0
<><> Gathering sources ><><><><><><><><><><><><><><><><><><><><><><><><><><><><>
Processing  1/1: [coq-mathcomp-analysis.0.5.0: http]
[coq-mathcomp-analysis.0.5.0] downloaded from https://github.com/math-comp/analysis/archive/0.5.0.tar.gz
Processing  1/1:
<><> Processing actions <><><><><><><><><><><><><><><><><><><><><><><><><><><><>
Processing  1/2: [coq-mathcomp-analysis: make]
+ /home/bench/.opam/opam-init/hooks/sandbox.sh "build" "make" "-j4" (CWD=/home/bench/.opam/ocaml-base-compiler.4.10.2/.opam-switch/build/coq-mathcomp-analysis.0.5.0)
- /home/bench/.opam/ocaml-base-compiler.4.10.2/bin/coq_makefile  -f _CoqProject -o Makefile.coq
- make -f Makefile.coq 
- make[1]: Entering directory '/home/bench/.opam/ocaml-base-compiler.4.10.2/.opam-switch/build/coq-mathcomp-analysis.0.5.0'
- COQDEP VFILES
- COQC theories/mathcomp_extra.v
- COQC theories/boolp.v
- COQC theories/forms.v
- COQC theories/altreals/xfinmap.v
- File "./theories/mathcomp_extra.v", line 29, characters 0-60:
- Error: Choice.mixin is already a coercion.
- 
- make[2]: *** [Makefile.coq:791: theories/mathcomp_extra.vo] Error 1
- make[2]: *** Waiting for unfinished jobs....
- File "./theories/forms.v", line 124, characters 0-52:
- Warning: class_of_axiom does not respect the uniform inheritance condition.
- [uniform-inheritance,typechecker]
- File "./theories/forms.v", line 140, characters 0-48:
- Warning: additiver does not respect the uniform inheritance condition.
- [uniform-inheritance,typechecker]
- File "./theories/forms.v", line 141, characters 0-45:
- Warning: linearr does not respect the uniform inheritance condition.
- [uniform-inheritance,typechecker]
- make[1]: *** [Makefile.coq:408: all] Error 2
- make[1]: Leaving directory '/home/bench/.opam/ocaml-base-compiler.4.10.2/.opam-switch/build/coq-mathcomp-analysis.0.5.0'
- make: *** [Makefile.common:63: this-build] Error 2
[ERROR] The compilation of coq-mathcomp-analysis failed at "/home/bench/.opam/opam-init/hooks/sandbox.sh build make -j4".
#=== ERROR while compiling coq-mathcomp-analysis.0.5.0 ========================#
# context              2.0.6 | linux/x86_64 | ocaml-base-compiler.4.10.2 | file:///home/bench/run/opam-coq-archive/released
# path                 ~/.opam/ocaml-base-compiler.4.10.2/.opam-switch/build/coq-mathcomp-analysis.0.5.0
# command              ~/.opam/opam-init/hooks/sandbox.sh build make -j4
# exit-code            2
# env-file             ~/.opam/log/coq-mathcomp-analysis-26822-335865.env
# output-file          ~/.opam/log/coq-mathcomp-analysis-26822-335865.out
### output ###
# [...]
# File "./theories/forms.v", line 124, characters 0-52:
# Warning: class_of_axiom does not respect the uniform inheritance condition.
# [uniform-inheritance,typechecker]
# File "./theories/forms.v", line 140, characters 0-48:
# Warning: additiver does not respect the uniform inheritance condition.
# [uniform-inheritance,typechecker]
# File "./theories/forms.v", line 141, characters 0-45:
# Warning: linearr does not respect the uniform inheritance condition.
# [uniform-inheritance,typechecker]
# make[1]: *** [Makefile.coq:408: all] Error 2
# make[1]: Leaving directory '/home/bench/.opam/ocaml-base-compiler.4.10.2/.opam-switch/build/coq-mathcomp-analysis.0.5.0'
# make: *** [Makefile.common:63: this-build] Error 2
<><> Error report <><><><><><><><><><><><><><><><><><><><><><><><><><><><><><><>
+- The following actions failed
| - build coq-mathcomp-analysis 0.5.0
+- 
- No changes have been performed
# Run eval $(opam env) to update the current shell environment
'opam install -y -v coq-mathcomp-analysis.0.5.0 coq.dev' failed.

Installation size

No files were installed.

Uninstall 🧹

Command
true
Return code
0
Missing removes
none
Wrong removes
none