Β« Up

mathcomp-fingroup 1.13.0 Error with dependencies πŸš’

πŸ“… (2022-05-24 01:37:32 UTC)

Context

# Packages matching: installed
# Name              # Installed # Synopsis
base-bigarray       base
base-threads        base
base-unix           base
conf-findutils      1           Virtual package relying on findutils
conf-gmp            4           Virtual package relying on a GMP lib system installation
coq                 dev         Formal proof management system
dune                3.1.1       Fast, portable, and opinionated build system
ocaml               4.10.2      The OCaml compiler (virtual package)
ocaml-base-compiler 4.10.2      Official release 4.10.2
ocaml-config        1           OCaml Switch Configuration
ocamlfind           1.9.3       A library manager for OCaml
zarith              1.12        Implements arithmetic and logical operations over arbitrary-precision integers
# opam file:
opam-version: "2.0"
maintainer: "Mathematical Components <mathcomp-dev@sympa.inria.fr>"
homepage: "https://math-comp.github.io/"
bug-reports: "https://github.com/math-comp/math-comp/issues"
dev-repo: "git+https://github.com/math-comp/math-comp.git"
license: "CECILL-B"
build: [ make "-C" "mathcomp/fingroup" "-j" "%{jobs}%" "COQEXTRAFLAGS+=-native-compiler yes" {coq-native:installed & coq:version < "8.13~" } ]
install: [ make "-C" "mathcomp/fingroup" "install" ]
depends: [ "coq-mathcomp-ssreflect" { = version } ]
tags: [ "keyword:finite groups" "keyword:small scale reflection" "keyword:mathematical components" "keyword:odd order theorem" "logpath:mathcomp.fingroup" ]
authors: [ "Jeremy Avigad <>" "Andrea Asperti <>" "Stephane Le Roux <>" "Yves Bertot <>" "Laurence Rideau <>" "Enrico Tassi <>" "Ioana Pasca <>" "Georges Gonthier <>" "Sidi Ould Biha <>" "Cyril Cohen <>" "Francois Garillot <>" "Alexey Solovyev <>" "Russell O'Connor <>" "Laurent ThΓ©ry <>" "Assia Mahboubi <>" ]
synopsis: "Mathematical Components Library on finite groups"
description: """
This library contains definitions and theorems about finite groups,
group quotients, group morphisms, group presentation, group action...
"""
url {
src: "https://github.com/math-comp/math-comp/archive/mathcomp-1.13.0.tar.gz"
checksum: "sha256=4334e915736f96032e1d4d502e70537047220af1a1c7a6740f770e45601bdab0"
}

Lint

Command
true
Return code
0

Dry install 🏜️

Dry install with the current Coq version:

Command
opam install -y --show-action coq-mathcomp-fingroup.1.13.0 coq.dev
Return code
0

Dry install without Coq/switch base, to test if the problem was incompatibility with the current Coq/OCaml version:

Command
true
Return code
0

Install dependencies

Command
opam list; echo; ulimit -Sv 4000000; timeout 4h opam install -y --deps-only coq-mathcomp-fingroup.1.13.0 coq.dev
Return code
7936
Duration
17 s
Output
# Packages matching: installed
# Name              # Installed # Synopsis
base-bigarray       base
base-threads        base
base-unix           base
conf-findutils      1           Virtual package relying on findutils
conf-gmp            4           Virtual package relying on a GMP lib system installation
coq                 dev         Formal proof management system
dune                3.1.1       Fast, portable, and opinionated build system
ocaml               4.10.2      The OCaml compiler (virtual package)
ocaml-base-compiler 4.10.2      Official release 4.10.2
ocaml-config        1           OCaml Switch Configuration
ocamlfind           1.9.3       A library manager for OCaml
zarith              1.12        Implements arithmetic and logical operations over arbitrary-precision integers
The following actions will be performed:
  - install coq-mathcomp-ssreflect 1.13.0
<><> Gathering sources ><><><><><><><><><><><><><><><><><><><><><><><><><><><><>
[coq-mathcomp-ssreflect.1.13.0] downloaded from https://github.com/math-comp/math-comp/archive/mathcomp-1.13.0.tar.gz
<><> Processing actions <><><><><><><><><><><><><><><><><><><><><><><><><><><><>
[ERROR] The compilation of coq-mathcomp-ssreflect failed at "/home/bench/.opam/opam-init/hooks/sandbox.sh build make -C mathcomp/ssreflect -j 4".
#=== ERROR while compiling coq-mathcomp-ssreflect.1.13.0 ======================#
# context              2.0.6 | linux/x86_64 | ocaml-base-compiler.4.10.2 | file:///home/bench/run/opam-coq-archive/released
# path                 ~/.opam/ocaml-base-compiler.4.10.2/.opam-switch/build/coq-mathcomp-ssreflect.1.13.0
# command              ~/.opam/opam-init/hooks/sandbox.sh build make -C mathcomp/ssreflect -j 4
# exit-code            2
# env-file             ~/.opam/log/coq-mathcomp-ssreflect-24258-335865.env
# output-file          ~/.opam/log/coq-mathcomp-ssreflect-24258-335865.out
### output ###
# [...]
# COQC ssrmatching.v
# COQC ssrfun.v
# COQC ssrbool.v
# File "./ssrbool.v", line 42, characters 0-128:
# Error: Notation "[ rel _ _ : _ | _ ]" is already defined at level 0
# with arguments name, name, constr, constr while it is now required to be
# at level 0 with arguments ident, ident, constr, constr.
# 
# make[2]: *** [Makefile.coq:791: ssrbool.vo] Error 1
# make[1]: *** [Makefile.coq:408: all] Error 2
# make: *** [../Makefile.common:99: this-build] Error 2
# make: Leaving directory '/home/bench/.opam/ocaml-base-compiler.4.10.2/.opam-switch/build/coq-mathcomp-ssreflect.1.13.0/mathcomp/ssreflect'
<><> Error report <><><><><><><><><><><><><><><><><><><><><><><><><><><><><><><>
+- The following actions failed
| - build coq-mathcomp-ssreflect 1.13.0
+- 
- No changes have been performed
# Run eval $(opam env) to update the current shell environment

Install πŸš€

Command
true
Return code
0
Duration
0 s

Installation size

No files were installed.

Uninstall 🧹

Command
true
Return code
0
Missing removes
none
Wrong removes
none