« Up

mathcomp-ssreflect 1.11+beta1 Error 🔥

📅 (2022-05-24 01:37:32 UTC)

Context

# Packages matching: installed
# Name              # Installed # Synopsis
base-bigarray       base
base-threads        base
base-unix           base
conf-findutils      1           Virtual package relying on findutils
conf-gmp            4           Virtual package relying on a GMP lib system installation
coq                 dev         Formal proof management system
dune                3.1.1       Fast, portable, and opinionated build system
ocaml               4.10.2      The OCaml compiler (virtual package)
ocaml-base-compiler 4.10.2      Official release 4.10.2
ocaml-config        1           OCaml Switch Configuration
ocamlfind           1.9.3       A library manager for OCaml
zarith              1.12        Implements arithmetic and logical operations over arbitrary-precision integers
# opam file:
opam-version: "2.0"
maintainer: "Mathematical Components <mathcomp-dev@sympa.inria.fr>"
homepage: "https://math-comp.github.io/"
bug-reports: "https://github.com/math-comp/math-comp/issues"
dev-repo: "git+https://github.com/math-comp/math-comp.git"
license: "CeCILL-B"
build: [ make "-C" "mathcomp/ssreflect" "-j" "%{jobs}%" ]
install: [ make "-C" "mathcomp/ssreflect" "install" ]
depends: [ "coq" { ((>= "8.7" & < "8.12~") | (= "dev"))} ]
tags: [ "keyword:small scale reflection" "keyword:mathematical components" "keyword:odd order theorem" "logpath:mathcomp.ssreflect" ]
authors: [ "Jeremy Avigad <>" "Andrea Asperti <>" "Stephane Le Roux <>" "Yves Bertot <>" "Laurence Rideau <>" "Enrico Tassi <>" "Ioana Pasca <>" "Georges Gonthier <>" "Sidi Ould Biha <>" "Cyril Cohen <>" "Francois Garillot <>" "Alexey Solovyev <>" "Russell O'Connor <>" "Laurent Théry <>" "Assia Mahboubi <>" ]
synopsis: "Small Scale Reflection"
description: """
This library includes the small scale reflection proof language
extension and the minimal set of libraries to take advantage of it.
This includes libraries on lists (seq), boolean and boolean
predicates, natural numbers and types with decidable equality,
finite types, finite sets, finite functions, finite graphs, basic arithmetics
and prime numbers, big operators
"""
url {
src: "https://github.com/math-comp/math-comp/archive/mathcomp-1.11+beta1.tar.gz"
checksum: "sha256=412e3bd8faae4c52a4e1651a3ea3ad949ae6f93a2ffbb579f0ebd4662d5d418e"
}

Lint

Command
true
Return code
0

Dry install 🏜️

Dry install with the current Coq version:

Command
opam install -y --show-action coq-mathcomp-ssreflect.1.11+beta1 coq.dev
Return code
0

Dry install without Coq/switch base, to test if the problem was incompatibility with the current Coq/OCaml version:

Command
true
Return code
0

Install dependencies

Command
opam list; echo; ulimit -Sv 4000000; timeout 4h opam install -y --deps-only coq-mathcomp-ssreflect.1.11+beta1 coq.dev
Return code
0
Duration
14 s

Install 🚀

Command
opam list; echo; ulimit -Sv 16000000; timeout 4h opam install -y coq-mathcomp-ssreflect.1.11+beta1 coq.dev
Return code
7936
Duration
18 s
Output
# Packages matching: installed
# Name              # Installed # Synopsis
base-bigarray       base
base-threads        base
base-unix           base
conf-findutils      1           Virtual package relying on findutils
conf-gmp            4           Virtual package relying on a GMP lib system installation
coq                 dev         Formal proof management system
dune                3.1.1       Fast, portable, and opinionated build system
ocaml               4.10.2      The OCaml compiler (virtual package)
ocaml-base-compiler 4.10.2      Official release 4.10.2
ocaml-config        1           OCaml Switch Configuration
ocamlfind           1.9.3       A library manager for OCaml
zarith              1.12        Implements arithmetic and logical operations over arbitrary-precision integers
[NOTE] Package coq is already installed (current version is dev).
The following actions will be performed:
  - install coq-mathcomp-ssreflect 1.11+beta1
<><> Gathering sources ><><><><><><><><><><><><><><><><><><><><><><><><><><><><>
[coq-mathcomp-ssreflect.1.11+beta1] downloaded from https://github.com/math-comp/math-comp/archive/mathcomp-1.11+beta1.tar.gz
<><> Processing actions <><><><><><><><><><><><><><><><><><><><><><><><><><><><>
[ERROR] The compilation of coq-mathcomp-ssreflect failed at "/home/bench/.opam/opam-init/hooks/sandbox.sh build make -C mathcomp/ssreflect -j 4".
#=== ERROR while compiling coq-mathcomp-ssreflect.1.11+beta1 ==================#
# context              2.0.6 | linux/x86_64 | ocaml-base-compiler.4.10.2 | file:///home/bench/run/opam-coq-archive/extra-dev
# path                 ~/.opam/ocaml-base-compiler.4.10.2/.opam-switch/build/coq-mathcomp-ssreflect.1.11+beta1
# command              ~/.opam/opam-init/hooks/sandbox.sh build make -C mathcomp/ssreflect -j 4
# exit-code            2
# env-file             ~/.opam/log/coq-mathcomp-ssreflect-25550-335865.env
# output-file          ~/.opam/log/coq-mathcomp-ssreflect-25550-335865.out
### output ###
# [...]
# [irrelevant-reserved-notation-only-parsing,parsing]
# COQC ssrfun.v
# COQC ssrbool.v
# File "./ssrbool.v", line 33, characters 0-152:
# Error: Notation "[ rel _ _ | _ ]" is already defined at level 0
# with arguments name, name, constr while it is now required to be at level 0
# with arguments ident, ident, constr.
# 
# make[2]: *** [Makefile.coq:791: ssrbool.vo] Error 1
# make[1]: *** [Makefile.coq:408: all] Error 2
# make: *** [../Makefile.common:85: this-build] Error 2
# make: Leaving directory '/home/bench/.opam/ocaml-base-compiler.4.10.2/.opam-switch/build/coq-mathcomp-ssreflect.1.11+beta1/mathcomp/ssreflect'
<><> Error report <><><><><><><><><><><><><><><><><><><><><><><><><><><><><><><>
+- The following actions failed
| - build coq-mathcomp-ssreflect 1.11+beta1
+- 
- No changes have been performed
# Run eval $(opam env) to update the current shell environment

Installation size

No files were installed.

Uninstall 🧹

Command
true
Return code
0
Missing removes
none
Wrong removes
none