« Up

paramcoq dev Error 🔥

📅 (2022-05-24 01:37:32 UTC)

Context

# Packages matching: installed
# Name              # Installed # Synopsis
base-bigarray       base
base-threads        base
base-unix           base
conf-findutils      1           Virtual package relying on findutils
conf-gmp            4           Virtual package relying on a GMP lib system installation
coq                 dev         Formal proof management system
dune                3.1.1       Fast, portable, and opinionated build system
ocaml               4.10.2      The OCaml compiler (virtual package)
ocaml-base-compiler 4.10.2      Official release 4.10.2
ocaml-config        1           OCaml Switch Configuration
ocamlfind           1.9.3       A library manager for OCaml
zarith              1.12        Implements arithmetic and logical operations over arbitrary-precision integers
# opam file:
opam-version: "2.0"
name: "coq-paramcoq"
version: "dev"
maintainer: "Pierre Roux <pierre.roux@onera.fr>"
homepage: "https://github.com/coq-community/paramcoq"
bug-reports: "https://github.com/coq-community/paramcoq/issues"
dev-repo: "git+https://github.com/coq-community/paramcoq.git"
license: "MIT"
build: [make "-j%{jobs}%"]
install: [make "install"]
remove: ["rm" "-R" "%{lib}%/coq/user-contrib/Param"]
depends: [
  "coq" {= "dev"}
]
tags: [
  "keyword:paramcoq"
  "keyword:parametricity"
  "keyword:OCaml modules"
  "category:Miscellaneous/Coq Extensions"
  "logpath:Param"
]
authors: [
  "Chantal Keller (Inria, École polytechnique)"
  "Marc Lasson (ÉNS de Lyon)"
  "Abhishek Anand"
  "Pierre Roux"
  "Emilio Jesús Gallego Arias"
  "Cyril Cohen"
  "Matthieu Sozeau"
]
synopsis: "Paramcoq"
description: """
The plugin is still in an experimental state. It is not very user
friendly (lack of good error messages) and still contains bugs. But is
useable enough to "translate" a large chunk of standard library."""
url {
  src: "git+https://github.com/coq-community/paramcoq.git"
}

Lint

Command
true
Return code
0

Dry install 🏜️

Dry install with the current Coq version:

Command
opam install -y --show-action coq-paramcoq.dev coq.dev
Return code
0

Dry install without Coq/switch base, to test if the problem was incompatibility with the current Coq/OCaml version:

Command
true
Return code
0

Install dependencies

Command
opam list; echo; ulimit -Sv 4000000; timeout 4h opam install -y --deps-only coq-paramcoq.dev coq.dev
Return code
0
Duration
12 s

Install 🚀

Command
opam list; echo; ulimit -Sv 16000000; timeout 4h opam install -y coq-paramcoq.dev coq.dev
Return code
7936
Duration
32 s
Output
# Packages matching: installed
# Name              # Installed # Synopsis
base-bigarray       base
base-threads        base
base-unix           base
conf-findutils      1           Virtual package relying on findutils
conf-gmp            4           Virtual package relying on a GMP lib system installation
coq                 dev         Formal proof management system
dune                3.1.1       Fast, portable, and opinionated build system
ocaml               4.10.2      The OCaml compiler (virtual package)
ocaml-base-compiler 4.10.2      Official release 4.10.2
ocaml-config        1           OCaml Switch Configuration
ocamlfind           1.9.3       A library manager for OCaml
zarith              1.12        Implements arithmetic and logical operations over arbitrary-precision integers
[NOTE] Package coq is already installed (current version is dev).
The following actions will be performed:
  - install coq-paramcoq dev
<><> Gathering sources ><><><><><><><><><><><><><><><><><><><><><><><><><><><><>
[coq-paramcoq.dev] synchronised from git+https://github.com/coq-community/paramcoq.git
<><> Processing actions <><><><><><><><><><><><><><><><><><><><><><><><><><><><>
[ERROR] The compilation of coq-paramcoq failed at "/home/bench/.opam/opam-init/hooks/sandbox.sh build make -j4".
#=== ERROR while compiling coq-paramcoq.dev ===================================#
# context              2.0.6 | linux/x86_64 | ocaml-base-compiler.4.10.2 | file:///home/bench/run/opam-coq-archive/extra-dev
# path                 ~/.opam/ocaml-base-compiler.4.10.2/.opam-switch/build/coq-paramcoq.dev
# command              ~/.opam/opam-init/hooks/sandbox.sh build make -j4
# exit-code            2
# env-file             ~/.opam/log/coq-paramcoq-4203-e4db2f.env
# output-file          ~/.opam/log/coq-paramcoq-4203-e4db2f.out
### output ###
# [...]
# CAMLOPT -c -for-pack Paramcoq src/parametricity.ml
# CAMLOPT -c -for-pack Paramcoq src/declare_translation.ml
# File "src/declare_translation.ml", line 105, characters 18-24:
# 105 |   add_definition ~tactic ~opaque ~poly ~scope ~kind ~hook name env evd a_R b_R
#                         ^^^^^^
# Error: This expression has type
#          Vernacexpr.locality_flag * unit Proofview.tactic
#        but an expression was expected of type unit Proofview.tactic
# make[2]: *** [Makefile.coq:739: src/declare_translation.cmx] Error 2
# make[1]: *** [Makefile.coq:408: all] Error 2
# make[1]: Leaving directory '/home/bench/.opam/ocaml-base-compiler.4.10.2/.opam-switch/build/coq-paramcoq.dev'
# make: *** [Makefile:2: all] Error 2
<><> Error report <><><><><><><><><><><><><><><><><><><><><><><><><><><><><><><>
+- The following actions failed
| - build coq-paramcoq dev
+- 
- No changes have been performed
# Run eval $(opam env) to update the current shell environment

Installation size

No files were installed.

Uninstall 🧹

Command
true
Return code
0
Missing removes
none
Wrong removes
none