« Up

prosa dev Error 🔥

📅 (2022-05-24 01:37:32 UTC)

Context

# Packages matching: installed
# Name              # Installed # Synopsis
base-bigarray       base
base-threads        base
base-unix           base
conf-findutils      1           Virtual package relying on findutils
conf-gmp            4           Virtual package relying on a GMP lib system installation
coq                 dev         Formal proof management system
dune                3.1.1       Fast, portable, and opinionated build system
ocaml               4.10.2      The OCaml compiler (virtual package)
ocaml-base-compiler 4.10.2      Official release 4.10.2
ocaml-config        1           OCaml Switch Configuration
ocamlfind           1.9.3       A library manager for OCaml
zarith              1.12        Implements arithmetic and logical operations over arbitrary-precision integers
# opam file:
opam-version: "2.0"
maintainer: "Pierre Roux <pierre.roux@onera.fr>"
homepage: "https://prosa.mpi-sws.org/"
dev-repo: "git+https://gitlab.mpi-sws.org/RT-PROOFS/rt-proofs.git"
bug-reports: "https://gitlab.mpi-sws.org/RT-PROOFS/rt-proofs/issues"
license: "BSD"
build: [
  ["./create_makefile.sh"]
  [make "-j%{jobs}%"]
]
install: [make "install"]
depends: [
  "coq" {>= "8.13"}
  "coq-mathcomp-ssreflect" {>= "1.12"}
]
tags: [
  "keyword:prosa"
  "keyword:real time"
  "keyword:schedulability analysis"
  "logpath:prosa"
]
authors: [
  "Felipe Cerqueira"
  "Björn Brandenburg"
  "Maxime Lesourd"
  "Sergey Bozhko"
  "Xiaojie Guo"
  "Sophie Quinton"
  "Marco Perronet"
]
synopsis: "A Foundation for Formally Proven Schedulability Analysis"
description: """Prosa is a repository of definitions and proofs for
real-time schedulability analysis built with Coq. Prosa’s
distinguishing characteristic is that Prosa prioritizes readability
over all other concerns to ensure that specifications remain
accessible to readers without a background in formal proofs. (A
background in real-time scheduling is assumed.)"""
url {
  src: "git+https://gitlab.mpi-sws.org/RT-PROOFS/rt-proofs.git"
}

Lint

Command
true
Return code
0

Dry install 🏜️

Dry install with the current Coq version:

Command
opam install -y --show-action coq-prosa.dev coq.dev
Return code
0

Dry install without Coq/switch base, to test if the problem was incompatibility with the current Coq/OCaml version:

Command
true
Return code
0

Install dependencies

Command
opam list; echo; ulimit -Sv 4000000; timeout 4h opam install -y --deps-only coq-prosa.dev coq.dev
Return code
0
Duration
2 m 31 s

Install 🚀

Command
opam list; echo; ulimit -Sv 16000000; timeout 4h opam install -y coq-prosa.dev coq.dev
Return code
7936
Duration
1 m 2 s
Output
# Packages matching: installed
# Name                 # Installed # Synopsis
base-bigarray          base
base-threads           base
base-unix              base
conf-findutils         1           Virtual package relying on findutils
conf-gmp               4           Virtual package relying on a GMP lib system installation
coq                    dev         Formal proof management system
coq-mathcomp-ssreflect dev         Small Scale Reflection
dune                   3.1.1       Fast, portable, and opinionated build system
ocaml                  4.10.2      The OCaml compiler (virtual package)
ocaml-base-compiler    4.10.2      Official release 4.10.2
ocaml-config           1           OCaml Switch Configuration
ocamlfind              1.9.3       A library manager for OCaml
zarith                 1.12        Implements arithmetic and logical operations over arbitrary-precision integers
[NOTE] Package coq is already installed (current version is dev).
The following actions will be performed:
  - install coq-prosa dev
<><> Gathering sources ><><><><><><><><><><><><><><><><><><><><><><><><><><><><>
[coq-prosa.dev] synchronised from git+https://gitlab.mpi-sws.org/RT-PROOFS/rt-proofs.git
<><> Processing actions <><><><><><><><><><><><><><><><><><><><><><><><><><><><>
[ERROR] The compilation of coq-prosa failed at "/home/bench/.opam/opam-init/hooks/sandbox.sh build make -j4".
#=== ERROR while compiling coq-prosa.dev ======================================#
# context              2.0.6 | linux/x86_64 | ocaml-base-compiler.4.10.2 | file:///home/bench/run/opam-coq-archive/extra-dev
# path                 ~/.opam/ocaml-base-compiler.4.10.2/.opam-switch/build/coq-prosa.dev
# command              ~/.opam/opam-init/hooks/sandbox.sh build make -j4
# exit-code            2
# env-file             ~/.opam/log/coq-prosa-15285-0a5907.env
# output-file          ~/.opam/log/coq-prosa-15285-0a5907.out
### output ###
# [...]
# COQC util/unit_growth.v
# File "./util/list.v", line 2, characters 0-34:
# Error: Cannot find a physical path bound to logical path mathcomp.zify.zify.
# 
# COQC classic/util/bigord.v
# make[1]: *** [Makefile:814: util/list.vo] Error 1
# make[1]: *** Waiting for unfinished jobs....
# File "./util/nat.v", line 2, characters 0-34:
# Error: Cannot find a physical path bound to logical path mathcomp.zify.zify.
# 
# make[1]: *** [Makefile:814: util/nat.vo] Error 1
# make: *** [Makefile:413: all] Error 2
<><> Error report <><><><><><><><><><><><><><><><><><><><><><><><><><><><><><><>
+- The following actions failed
| - build coq-prosa dev
+- 
- No changes have been performed
# Run eval $(opam env) to update the current shell environment

Installation size

No files were installed.

Uninstall 🧹

Command
true
Return code
0
Missing removes
none
Wrong removes
none