ยซ Up

reduction-effects 0.1.2 Error ๐Ÿ”ฅ

๐Ÿ“… (2022-05-24 01:37:32 UTC)

Context

# Packages matching: installed
# Name              # Installed # Synopsis
base-bigarray       base
base-threads        base
base-unix           base
conf-findutils      1           Virtual package relying on findutils
conf-gmp            4           Virtual package relying on a GMP lib system installation
coq                 dev         Formal proof management system
dune                3.1.1       Fast, portable, and opinionated build system
ocaml               4.10.2      The OCaml compiler (virtual package)
ocaml-base-compiler 4.10.2      Official release 4.10.2
ocaml-config        1           OCaml Switch Configuration
ocamlfind           1.9.3       A library manager for OCaml
zarith              1.12        Implements arithmetic and logical operations over arbitrary-precision integers
# opam file:
opam-version: "2.0"
synopsis: "A Coq plugin to add reduction side effects to some Coq reduction strategies"
maintainer: "Yishuai Li <yishuai@cis.upenn.edu>"
authors: "Hugo Herbelin <Hugo.Herbelin@inria.fr>"
license: "LGPL-2.1"
homepage: "https://github.com/coq-community/reduction-effects"
bug-reports: "https://github.com/coq-community/reduction-effects/issues"
depends: [
  "coq" { >= "8.10" }
]
build:   [make "-j%{jobs}%"]
install: [make "-j%{jobs}%" "install"]
run-test:[make "-j%{jobs}%" "test"]
dev-repo: "git+https://github.com/coq-community/reduction-effects"
url {
  src: "https://github.com/coq-community/reduction-effects/archive/v0.1.2.tar.gz"
  checksum: "md5=c371e8adeb7d749035a2dd55ede49eb4"
}
tags: [
  "logpath:ReductionEffect"
]

Lint

Command
true
Return code
0

Dry install ๐Ÿœ๏ธ

Dry install with the current Coq version:

Command
opam install -y --show-action coq-reduction-effects.0.1.2 coq.dev
Return code
0

Dry install without Coq/switch base, to test if the problem was incompatibility with the current Coq/OCaml version:

Command
true
Return code
0

Install dependencies

Command
opam list; echo; ulimit -Sv 4000000; timeout 4h opam install -y --deps-only coq-reduction-effects.0.1.2 coq.dev
Return code
0
Duration
39 s

Install ๐Ÿš€

Command
opam list; echo; ulimit -Sv 16000000; timeout 4h opam install -y -v coq-reduction-effects.0.1.2 coq.dev
Return code
7936
Duration
41 s
Output
# Packages matching: installed
# Name              # Installed # Synopsis
base-bigarray       base
base-threads        base
base-unix           base
conf-findutils      1           Virtual package relying on findutils
conf-gmp            4           Virtual package relying on a GMP lib system installation
coq                 dev         Formal proof management system
dune                3.1.1       Fast, portable, and opinionated build system
ocaml               4.10.2      The OCaml compiler (virtual package)
ocaml-base-compiler 4.10.2      Official release 4.10.2
ocaml-config        1           OCaml Switch Configuration
ocamlfind           1.9.3       A library manager for OCaml
zarith              1.12        Implements arithmetic and logical operations over arbitrary-precision integers
[NOTE] Package coq is already installed (current version is dev).
The following actions will be performed:
  - install coq-reduction-effects 0.1.2
<><> Gathering sources ><><><><><><><><><><><><><><><><><><><><><><><><><><><><>
Processing  1/1: [coq-reduction-effects.0.1.2: http]
[coq-reduction-effects.0.1.2] downloaded from https://github.com/coq-community/reduction-effects/archive/v0.1.2.tar.gz
Processing  1/1:
<><> Processing actions <><><><><><><><><><><><><><><><><><><><><><><><><><><><>
Processing  1/2: [coq-reduction-effects: make]
+ /home/bench/.opam/opam-init/hooks/sandbox.sh "build" "make" "-j4" (CWD=/home/bench/.opam/ocaml-base-compiler.4.10.2/.opam-switch/build/coq-reduction-effects.0.1.2)
- coq_makefile -f _CoqProject -o Makefile.coq
- Warning: it is recommended you provide a META.package-name file
- Warning: since you build plugins. See also -generate-meta-for-package.
- make -f Makefile.coq all
- make[1]: Entering directory '/home/bench/.opam/ocaml-base-compiler.4.10.2/.opam-switch/build/coq-reduction-effects.0.1.2'
- COQDEP VFILES
- COQPP redeffect.mlg
- OCAMLLIBDEP redeffect_plugin.mlpack
- CAMLDEP redeffect.ml
- *** Error: in file PrintingEffect.v, redeffect_plugin is not a valid plugin name anymore.Plugins should be loaded using their public name according to findlib,
-            for example package-name.foo and not foo_plugin.
-            If you are building with dune < 2.9.4 you must specify both
-            the legacy and the findlib plugin name as in:
-            Declare ML Module "foo_plugin:package-name.foo".
- COQDEP VFILES
- *** Error: in file PrintingEffect.v, redeffect_plugin is not a valid plugin name anymore.Plugins should be loaded using their public name according to findlib,
-            for example package-name.foo and not foo_plugin.
-            If you are building with dune < 2.9.4 you must specify both
-            the legacy and the findlib plugin name as in:
-            Declare ML Module "foo_plugin:package-name.foo".
- COQDEP VFILES
- *** Error: in file PrintingEffect.v, redeffect_plugin is not a valid plugin name anymore.Plugins should be loaded using their public name according to findlib,
-            for example package-name.foo and not foo_plugin.
-            If you are building with dune < 2.9.4 you must specify both
-            the legacy and the findlib plugin name as in:
-            Declare ML Module "foo_plugin:package-name.foo".
- COQDEP VFILES
- *** Error: in file PrintingEffect.v, redeffect_plugin is not a valid plugin name anymore.Plugins should be loaded using their public name according to findlib,
-            for example package-name.foo and not foo_plugin.
-            If you are building with dune < 2.9.4 you must specify both
-            the legacy and the findlib plugin name as in:
-            Declare ML Module "foo_plugin:package-name.foo".
- make[2]: *** No rule to make target '.Makefile.coq.d', needed by 'PrintingEffect.vo'.  Stop.
- make[1]: *** [Makefile.coq:408: all] Error 2
- make[1]: Leaving directory '/home/bench/.opam/ocaml-base-compiler.4.10.2/.opam-switch/build/coq-reduction-effects.0.1.2'
- make: *** [Makefile:2: all] Error 2
[ERROR] The compilation of coq-reduction-effects failed at "/home/bench/.opam/opam-init/hooks/sandbox.sh build make -j4".
#=== ERROR while compiling coq-reduction-effects.0.1.2 ========================#
# context              2.0.6 | linux/x86_64 | ocaml-base-compiler.4.10.2 | file:///home/bench/run/opam-coq-archive/released
# path                 ~/.opam/ocaml-base-compiler.4.10.2/.opam-switch/build/coq-reduction-effects.0.1.2
# command              ~/.opam/opam-init/hooks/sandbox.sh build make -j4
# exit-code            2
# env-file             ~/.opam/log/coq-reduction-effects-19609-865888.env
# output-file          ~/.opam/log/coq-reduction-effects-19609-865888.out
### output ###
# *** Error: in file PrintingEffect.v, redeffect_plugin is not a valid plugin name anymore.Plugins should be loaded using their public name according to findlib,
# [...]
#            Declare ML Module "foo_plugin:package-name.foo".
# COQDEP VFILES
# *** Error: in file PrintingEffect.v, redeffect_plugin is not a valid plugin name anymore.Plugins should be loaded using their public name according to findlib,
#            for example package-name.foo and not foo_plugin.
#            If you are building with dune < 2.9.4 you must specify both
#            the legacy and the findlib plugin name as in:
#            Declare ML Module "foo_plugin:package-name.foo".
# make[2]: *** No rule to make target '.Makefile.coq.d', needed by 'PrintingEffect.vo'.  Stop.
# make[1]: *** [Makefile.coq:408: all] Error 2
# make[1]: Leaving directory '/home/bench/.opam/ocaml-base-compiler.4.10.2/.opam-switch/build/coq-reduction-effects.0.1.2'
# make: *** [Makefile:2: all] Error 2
<><> Error report <><><><><><><><><><><><><><><><><><><><><><><><><><><><><><><>
+- The following actions failed
| - build coq-reduction-effects 0.1.2
+- 
- No changes have been performed
# Run eval $(opam env) to update the current shell environment
'opam install -y -v coq-reduction-effects.0.1.2 coq.dev' failed.

Installation size

No files were installed.

Uninstall ๐Ÿงน

Command
true
Return code
0
Missing removes
none
Wrong removes
none