ยซ Up

smc dev Error with dependencies ๐Ÿš’

๐Ÿ“… (2022-05-24 01:37:32 UTC)

Context

# Packages matching: installed
# Name              # Installed # Synopsis
base-bigarray       base
base-threads        base
base-unix           base
conf-findutils      1           Virtual package relying on findutils
conf-gmp            4           Virtual package relying on a GMP lib system installation
coq                 dev         Formal proof management system
dune                3.1.1       Fast, portable, and opinionated build system
ocaml               4.10.2      The OCaml compiler (virtual package)
ocaml-base-compiler 4.10.2      Official release 4.10.2
ocaml-config        1           OCaml Switch Configuration
ocamlfind           1.9.3       A library manager for OCaml
zarith              1.12        Implements arithmetic and logical operations over arbitrary-precision integers
# opam file:
opam-version: "2.0"
maintainer: "dev@clarus.me"
homepage: "https://github.com/coq-contribs/smc"
license: "LGPL 2"
build: [
  ["coq_makefile" "-f" "Make" "-o" "Makefile"]
  [make "-j%{jobs}%"]
  [make "install"]
]
remove: ["rm" "-R" "%{lib}%/coq/user-contrib/SMC"]
depends: [
  "ocaml"
  "coq" {= "dev"}
  "coq-int-map" {= "dev"}
]
tags: [ "keyword:binary decision diagrams" "keyword:classical logic" "keyword:propositional logic" "keyword:garbage collection" "keyword:modal mu calculus" "keyword:model checking" "keyword:symbolic model checking" "keyword:reflection" "category:Computer Science/Decision Procedures and Certified Algorithms/Decision procedures" "date:2002-11" ]
authors: [ "Kumar Neeraj Verma <verma@lsv.ens-cachan.fr>" ]
synopsis: "BDD based symbolic model checker for the modal mu-calculus."
description: """
Provides BDD algorithms, a symbolic model checker for the modal
mu-calculus based on it, together with a garbage collector"""
flags: light-uninstall
url {
  src: "git+https://github.com/coq-contribs/smc.git#master"
}

Lint

Command
true
Return code
0

Dry install ๐Ÿœ๏ธ

Dry install with the current Coq version:

Command
opam install -y --show-action coq-smc.dev coq.dev
Return code
0

Dry install without Coq/switch base, to test if the problem was incompatibility with the current Coq/OCaml version:

Command
true
Return code
0

Install dependencies

Command
opam list; echo; ulimit -Sv 4000000; timeout 4h opam install -y --deps-only coq-smc.dev coq.dev
Return code
7936
Duration
27 s
Output
# Packages matching: installed
# Name              # Installed # Synopsis
base-bigarray       base
base-threads        base
base-unix           base
conf-findutils      1           Virtual package relying on findutils
conf-gmp            4           Virtual package relying on a GMP lib system installation
coq                 dev         Formal proof management system
dune                3.1.1       Fast, portable, and opinionated build system
ocaml               4.10.2      The OCaml compiler (virtual package)
ocaml-base-compiler 4.10.2      Official release 4.10.2
ocaml-config        1           OCaml Switch Configuration
ocamlfind           1.9.3       A library manager for OCaml
zarith              1.12        Implements arithmetic and logical operations over arbitrary-precision integers
The following actions will be performed:
  - install coq-int-map dev
<><> Gathering sources ><><><><><><><><><><><><><><><><><><><><><><><><><><><><>
[coq-int-map.dev] synchronised from git+https://github.com/coq-contribs/int-map.git#master
<><> Processing actions <><><><><><><><><><><><><><><><><><><><><><><><><><><><>
[ERROR] The compilation of coq-int-map failed at "/home/bench/.opam/opam-init/hooks/sandbox.sh build make -j4".
#=== ERROR while compiling coq-int-map.dev ====================================#
# context              2.0.6 | linux/x86_64 | ocaml-base-compiler.4.10.2 | file:///home/bench/run/opam-coq-archive/extra-dev
# path                 ~/.opam/ocaml-base-compiler.4.10.2/.opam-switch/build/coq-int-map.dev
# command              ~/.opam/opam-init/hooks/sandbox.sh build make -j4
# exit-code            2
# env-file             ~/.opam/log/coq-int-map-1292-0a5907.env
# output-file          ~/.opam/log/coq-int-map-1292-0a5907.out
### output ###
# COQDEP VFILES
# COQC Map.v
# File "./Map.v", line 51, characters 31-35:
# Error: The reference Neqb was not found in the current environment.
# 
# make[1]: *** [Makefile:791: Map.vo] Error 1
# make: *** [Makefile:408: all] Error 2
<><> Error report <><><><><><><><><><><><><><><><><><><><><><><><><><><><><><><>
+- The following actions failed
| - build coq-int-map dev
+- 
- No changes have been performed
# Run eval $(opam env) to update the current shell environment

Install ๐Ÿš€

Command
true
Return code
0
Duration
0 s

Installation size

No files were installed.

Uninstall ๐Ÿงน

Command
true
Return code
0
Missing removes
none
Wrong removes
none