ยซ Up

category-theory dev Error ๐Ÿ”ฅ

๐Ÿ“… (2022-05-14 08:21:45 UTC)

Context

# Packages matching: installed
# Name                # Installed # Synopsis
base-bigarray         base
base-threads          base
base-unix             base
conf-findutils        1           Virtual package relying on findutils
conf-gmp              4           Virtual package relying on a GMP lib system installation
coq                   dev         Formal proof management system
dune                  3.1.1       Fast, portable, and opinionated build system
ocaml                 4.12.1      The OCaml compiler (virtual package)
ocaml-base-compiler   4.12.1      Official release 4.12.1
ocaml-config          2           OCaml Switch Configuration
ocaml-options-vanilla 1           Ensure that OCaml is compiled with no special options enabled
ocamlfind             1.9.3       A library manager for OCaml
zarith                1.12        Implements arithmetic and logical operations over arbitrary-precision integers
# opam file:
opam-version: "2.0"
maintainer: "johnw@newartisans.com"
homepage: "https://github.com/jwiegley/category-theory"
dev-repo: "git+https://github.com/jwiegley/category-theory.git"
bug-reports: "https://github.com/jwiegley/category-theory/issues"
license: "BSD-3-Clause"
synopsis: "An axiom-free formalization of category theory in Coq"
description: """
An axiom-free formalization of category theory in Coq for personal study and
practical work.
"""
build: [make "JOBS=%{jobs}%" ]
install: [make "install"]
depends: [
  "coq" {>= "8.10"}
  # "coq-equations" {(>= "1.2" & < "1.3~") | (= "dev")}
]
tags: [
  "logpath:Category"
]
authors: [
  "John Wiegley"
]
url {
  src: "git+https://github.com/jwiegley/category-theory.git#master"
}

Lint

Command
true
Return code
0

Dry install ๐Ÿœ๏ธ

Dry install with the current Coq version:

Command
opam install -y --show-action coq-category-theory.dev coq.dev
Return code
0

Dry install without Coq/switch base, to test if the problem was incompatibility with the current Coq/OCaml version:

Command
true
Return code
0

Install dependencies

Command
opam list; echo; ulimit -Sv 4000000; timeout 4h opam install -y --deps-only coq-category-theory.dev coq.dev
Return code
0
Duration
12 s

Install ๐Ÿš€

Command
opam list; echo; ulimit -Sv 16000000; timeout 4h opam install -y coq-category-theory.dev coq.dev
Return code
7936
Duration
53 m 23 s
Output
# Packages matching: installed
# Name                # Installed # Synopsis
base-bigarray         base
base-threads          base
base-unix             base
conf-findutils        1           Virtual package relying on findutils
conf-gmp              4           Virtual package relying on a GMP lib system installation
coq                   dev         Formal proof management system
dune                  3.1.1       Fast, portable, and opinionated build system
ocaml                 4.12.1      The OCaml compiler (virtual package)
ocaml-base-compiler   4.12.1      Official release 4.12.1
ocaml-config          2           OCaml Switch Configuration
ocaml-options-vanilla 1           Ensure that OCaml is compiled with no special options enabled
ocamlfind             1.9.3       A library manager for OCaml
zarith                1.12        Implements arithmetic and logical operations over arbitrary-precision integers
[NOTE] Package coq is already installed (current version is dev).
The following actions will be performed:
  - install coq-category-theory dev
<><> Gathering sources ><><><><><><><><><><><><><><><><><><><><><><><><><><><><>
[coq-category-theory.dev] synchronised from git+https://github.com/jwiegley/category-theory.git#master
<><> Processing actions <><><><><><><><><><><><><><><><><><><><><><><><><><><><>
[ERROR] The compilation of coq-category-theory failed at "/home/bench/.opam/opam-init/hooks/sandbox.sh build make JOBS=4".
#=== ERROR while compiling coq-category-theory.dev ============================#
# context              2.0.8 | linux/x86_64 | ocaml-base-compiler.4.12.1 | file:///home/bench/run/opam-coq-archive/extra-dev
# path                 ~/.opam/ocaml-base-compiler.4.12.1/.opam-switch/build/coq-category-theory.dev
# command              ~/.opam/opam-init/hooks/sandbox.sh build make JOBS=4
# exit-code            2
# env-file             ~/.opam/log/coq-category-theory-3780-e4db2f.env
# output-file          ~/.opam/log/coq-category-theory-3780-e4db2f.out
### output ###
# [...]
# COQC Construction/Comma/Natural/Transformation.v
# COQC Construction/Coproduct.v
# COQC Construction/Enriched.v
# COQC Lib/TList.v
# File "./Lib/TList.v", line 14, characters 0-40:
# Error: Cannot find a physical path bound to logical path
# Equations with prefix Equations.
# 
# make[2]: *** [Makefile.coq:791: Lib/TList.vo] Error 1
# make[1]: *** [Makefile.coq:408: all] Error 2
# make[1]: Leaving directory '/home/bench/.opam/ocaml-base-compiler.4.12.1/.opam-switch/build/coq-category-theory.dev'
# make: *** [Makefile:15: category-theory] Error 2
<><> Error report <><><><><><><><><><><><><><><><><><><><><><><><><><><><><><><>
+- The following actions failed
| - build coq-category-theory dev
+- 
- No changes have been performed
# Run eval $(opam env) to update the current shell environment

Installation size

No files were installed.

Uninstall ๐Ÿงน

Command
true
Return code
0
Missing removes
none
Wrong removes
none