« Up

fssec-model dev Error 🔥

📅 (2022-05-14 08:21:45 UTC)

Context

# Packages matching: installed
# Name                # Installed # Synopsis
base-bigarray         base
base-threads          base
base-unix             base
conf-findutils        1           Virtual package relying on findutils
conf-gmp              4           Virtual package relying on a GMP lib system installation
coq                   dev         Formal proof management system
dune                  3.1.1       Fast, portable, and opinionated build system
ocaml                 4.12.1      The OCaml compiler (virtual package)
ocaml-base-compiler   4.12.1      Official release 4.12.1
ocaml-config          2           OCaml Switch Configuration
ocaml-options-vanilla 1           Ensure that OCaml is compiled with no special options enabled
ocamlfind             1.9.3       A library manager for OCaml
zarith                1.12        Implements arithmetic and logical operations over arbitrary-precision integers
# opam file:
opam-version: "2.0"
maintainer: "dev@clarus.me"
homepage: "https://github.com/coq-contribs/fssec-model"
license: "Proprietary"
build: [
  ["coq_makefile" "-f" "Make" "-o" "Makefile"]
  [make "-j%{jobs}%"]
]
install: [make "install"]
remove: ["rm" "-R" "%{lib}%/coq/user-contrib/FSSecModel"]
depends: [
  "ocaml"
  "coq" {= "dev"}
]
tags: [ "keyword:security" "keyword:filesystem" "keyword:unix" "keyword:mls" "keyword:access control" "category:Computer Science/Operating Systems" "date:2002-04-24" ]
authors: [ "Maximiliano Cristiá <>" ]
synopsis:
  "Formal verification of an extension of a UNIX compatible, secure filesystem."
flags: light-uninstall
url {
  src: "git+https://github.com/coq-contribs/fssec-model.git#master"
}

Lint

Command
true
Return code
0

Dry install 🏜️

Dry install with the current Coq version:

Command
opam install -y --show-action coq-fssec-model.dev coq.dev
Return code
0

Dry install without Coq/switch base, to test if the problem was incompatibility with the current Coq/OCaml version:

Command
true
Return code
0

Install dependencies

Command
opam list; echo; ulimit -Sv 4000000; timeout 4h opam install -y --deps-only coq-fssec-model.dev coq.dev
Return code
0
Duration
13 s

Install 🚀

Command
opam list; echo; ulimit -Sv 16000000; timeout 4h opam install -y coq-fssec-model.dev coq.dev
Return code
7936
Duration
38 s
Output
# Packages matching: installed
# Name                # Installed # Synopsis
base-bigarray         base
base-threads          base
base-unix             base
conf-findutils        1           Virtual package relying on findutils
conf-gmp              4           Virtual package relying on a GMP lib system installation
coq                   dev         Formal proof management system
dune                  3.1.1       Fast, portable, and opinionated build system
ocaml                 4.12.1      The OCaml compiler (virtual package)
ocaml-base-compiler   4.12.1      Official release 4.12.1
ocaml-config          2           OCaml Switch Configuration
ocaml-options-vanilla 1           Ensure that OCaml is compiled with no special options enabled
ocamlfind             1.9.3       A library manager for OCaml
zarith                1.12        Implements arithmetic and logical operations over arbitrary-precision integers
[NOTE] Package coq is already installed (current version is dev).
The following actions will be performed:
  - install coq-fssec-model dev
<><> Gathering sources ><><><><><><><><><><><><><><><><><><><><><><><><><><><><>
[coq-fssec-model.dev] synchronised from git+https://github.com/coq-contribs/fssec-model.git#master
<><> Processing actions <><><><><><><><><><><><><><><><><><><><><><><><><><><><>
[ERROR] The compilation of coq-fssec-model failed at "/home/bench/.opam/opam-init/hooks/sandbox.sh build make -j4".
#=== ERROR while compiling coq-fssec-model.dev ================================#
# context              2.0.8 | linux/x86_64 | ocaml-base-compiler.4.12.1 | file:///home/bench/run/opam-coq-archive/extra-dev
# path                 ~/.opam/ocaml-base-compiler.4.12.1/.opam-switch/build/coq-fssec-model.dev
# command              ~/.opam/opam-init/hooks/sandbox.sh build make -j4
# exit-code            2
# env-file             ~/.opam/log/coq-fssec-model-2863-0a5907.env
# output-file          ~/.opam/log/coq-fssec-model-2863-0a5907.out
### output ###
# [...]
# deprecated. Please specify a hint database.
# [implicit-core-hint-db,deprecated]
# File "./ListSet.v", line 346, characters 2-47:
# Warning: Adding and removing hints in the core database implicitly is
# deprecated. Please specify a hint database.
# [implicit-core-hint-db,deprecated]
# COQC ListFunctions.v
# File "./ListFunctions.v", line 27, characters 26-30:
# Error: Syntax error: 'end' expected after [branches] (in [term_match]).
# 
# make[1]: *** [Makefile:791: ListFunctions.vo] Error 1
# make: *** [Makefile:408: all] Error 2
<><> Error report <><><><><><><><><><><><><><><><><><><><><><><><><><><><><><><>
+- The following actions failed
| - build coq-fssec-model dev
+- 
- No changes have been performed
# Run eval $(opam env) to update the current shell environment

Installation size

No files were installed.

Uninstall 🧹

Command
true
Return code
0
Missing removes
none
Wrong removes
none