ยซ Up

infotheo 0.3.7 Error with dependencies ๐Ÿš’

๐Ÿ“… (2022-05-14 08:21:45 UTC)

Context

# Packages matching: installed
# Name                # Installed # Synopsis
base-bigarray         base
base-threads          base
base-unix             base
conf-findutils        1           Virtual package relying on findutils
conf-gmp              4           Virtual package relying on a GMP lib system installation
coq                   dev         Formal proof management system
dune                  3.1.1       Fast, portable, and opinionated build system
ocaml                 4.12.1      The OCaml compiler (virtual package)
ocaml-base-compiler   4.12.1      Official release 4.12.1
ocaml-config          2           OCaml Switch Configuration
ocaml-options-vanilla 1           Ensure that OCaml is compiled with no special options enabled
ocamlfind             1.9.3       A library manager for OCaml
zarith                1.12        Implements arithmetic and logical operations over arbitrary-precision integers
# opam file:
opam-version: "2.0"
maintainer: "Reynald Affeldt <reynald.affeldt@aist.go.jp>"
homepage: "https://github.com/affeldt-aist/infotheo"
dev-repo: "git+https://github.com/affeldt-aist/infotheo.git"
bug-reports: "https://github.com/affeldt-aist/infotheo/issues"
license: "LGPL-2.1-or-later"
synopsis: "Discrete probabilities and information theory for Coq"
description: """
Infotheo is a Coq library for reasoning about discrete probabilities,
information theory, and linear error-correcting codes."""
build: [
  [make "-j%{jobs}%" ]
  [make "-C" "extraction" "tests"] {with-test}
]
install: [make "install"]
depends: [
  "coq" { (>= "8.14" & < "8.16~") | (= "dev") }
  "coq-mathcomp-ssreflect" { (>= "1.13.0" & < "1.15~") | (= "dev") }
  "coq-mathcomp-fingroup" { (>= "1.13.0" & < "1.15~") | (= "dev")  }
  "coq-mathcomp-algebra" { (>= "1.13.0" & < "1.15~") | (= "dev")  }
  "coq-mathcomp-solvable" { (>= "1.13.0" & < "1.15~") | (= "dev")  }
  "coq-mathcomp-field" { (>= "1.13.0" & < "1.15~") | (= "dev")  }
  "coq-mathcomp-analysis" { (>= "0.4.0") & (< "0.6~")}
]
tags: [
  "keyword:information theory"
  "keyword:probability"
  "keyword:error-correcting codes"
  "keyword:convexity"
  "logpath:infotheo"
  "date:2022-04-14"
]
authors: [
  "Reynald Affeldt, AIST"
  "Manabu Hagiwara, Chiba U. (previously AIST)"
  "Jonas Senizergues, ENS Cachan (internship at AIST)"
  "Jacques Garrigue, Nagoya U."
  "Kazuhiko Sakaguchi, Tsukuba U."
  "Taku Asai, Nagoya U. (M2)"
  "Takafumi Saikawa, Nagoya U."
  "Naruomi Obata, Titech (M2)"
]
url {
  http: "https://github.com/affeldt-aist/infotheo/archive/0.3.7.tar.gz"
  checksum: "sha512=5c49496ea6042c0cfed10c69f3d4ea8c6c6433c574b1d308174792213ed46e28c22d797f8eab5ef2a5e9ad1eeb4bd1fa9f3fc50e392c449a92395a77432a90cd"
}

Lint

Command
true
Return code
0

Dry install ๐Ÿœ๏ธ

Dry install with the current Coq version:

Command
opam install -y --show-action coq-infotheo.0.3.7 coq.dev
Return code
0

Dry install without Coq/switch base, to test if the problem was incompatibility with the current Coq/OCaml version:

Command
true
Return code
0

Install dependencies

Command
opam list; echo; ulimit -Sv 4000000; timeout 4h opam install -y --deps-only coq-infotheo.0.3.7 coq.dev
Return code
7936
Duration
1 h 13 m
Output
# Packages matching: installed
# Name                # Installed # Synopsis
base-bigarray         base
base-threads          base
base-unix             base
conf-findutils        1           Virtual package relying on findutils
conf-gmp              4           Virtual package relying on a GMP lib system installation
coq                   dev         Formal proof management system
dune                  3.1.1       Fast, portable, and opinionated build system
ocaml                 4.12.1      The OCaml compiler (virtual package)
ocaml-base-compiler   4.12.1      Official release 4.12.1
ocaml-config          2           OCaml Switch Configuration
ocaml-options-vanilla 1           Ensure that OCaml is compiled with no special options enabled
ocamlfind             1.9.3       A library manager for OCaml
zarith                1.12        Implements arithmetic and logical operations over arbitrary-precision integers
The following actions will be performed:
  - install ppx_derivers           1.2.1
  - install seq                    base
  - install sexplib0               v0.15.0
  - install cppo                   1.6.8
  - install menhirLib              dev
  - install result                 1.5
  - install coq-mathcomp-ssreflect dev
  - install ocaml-compiler-libs    v0.12.4
  - install stdlib-shims           0.3.0
  - install menhirSdk              dev
  - install re                     1.10.4
  - install coq-mathcomp-finmap    dev
  - install coq-mathcomp-fingroup  dev
  - install coq-mathcomp-bigenough dev
  - install ppxlib                 0.26.0
  - install menhir                 dev
  - install coq-mathcomp-algebra   dev
  - install ppx_deriving           5.2.1
  - install coq-mathcomp-solvable  dev
  - install elpi                   1.15.2
  - install coq-mathcomp-field     dev
  - install coq-elpi               dev
  - install coq-hierarchy-builder  dev
  - install coq-mathcomp-analysis  0.5.0
===== 24 to install =====
<><> Gathering sources ><><><><><><><><><><><><><><><><><><><><><><><><><><><><>
[coq-hierarchy-builder.dev] synchronised from git+https://github.com/math-comp/hierarchy-builder.git#coq-master
[coq-mathcomp-analysis.0.5.0] downloaded from https://github.com/math-comp/analysis/archive/0.5.0.tar.gz
[coq-elpi.dev] synchronised from git+https://github.com/LPCIC/coq-elpi.git#coq-master
[coq-mathcomp-bigenough.dev] synchronised from git+https://github.com/math-comp/bigenough.git#master
[coq-mathcomp-algebra.dev] synchronised from git+https://github.com/math-comp/math-comp.git
[coq-mathcomp-fingroup.dev] synchronised from git+https://github.com/math-comp/math-comp.git
[coq-mathcomp-field.dev] synchronised from git+https://github.com/math-comp/math-comp.git
[coq-mathcomp-solvable.dev] synchronised from git+https://github.com/math-comp/math-comp.git
[cppo.1.6.8] downloaded from cache at https://opam.ocaml.org/cache
[elpi.1.15.2] downloaded from cache at https://opam.ocaml.org/cache
[coq-mathcomp-ssreflect.dev] synchronised from git+https://github.com/math-comp/math-comp.git#master
[coq-mathcomp-finmap.dev] synchronised from git+https://github.com/math-comp/finmap.git#master
[menhirLib.dev] synchronised from git+https://gitlab.inria.fr/fpottier/menhir.git#master
[ocaml-compiler-libs.v0.12.4] downloaded from cache at https://opam.ocaml.org/cache
[ppx_derivers.1.2.1] downloaded from cache at https://opam.ocaml.org/cache
[ppx_deriving.5.2.1] downloaded from cache at https://opam.ocaml.org/cache
[menhir.dev] synchronised from git+https://gitlab.inria.fr/fpottier/menhir.git#master
[menhirSdk.dev] synchronised from git+https://gitlab.inria.fr/fpottier/menhir.git#master
[ppxlib.0.26.0] downloaded from cache at https://opam.ocaml.org/cache
[re.1.10.4] downloaded from cache at https://opam.ocaml.org/cache
[result.1.5] downloaded from cache at https://opam.ocaml.org/cache
[sexplib0.v0.15.0] downloaded from cache at https://opam.ocaml.org/cache
[stdlib-shims.0.3.0] downloaded from cache at https://opam.ocaml.org/cache
<><> Processing actions <><><><><><><><><><><><><><><><><><><><><><><><><><><><>
-> installed cppo.1.6.8
-> installed menhirLib.dev
-> installed menhirSdk.dev
-> installed ocaml-compiler-libs.v0.12.4
-> installed ppx_derivers.1.2.1
-> installed result.1.5
-> installed seq.base
-> installed sexplib0.v0.15.0
-> installed stdlib-shims.0.3.0
-> installed re.1.10.4
-> installed menhir.dev
-> installed ppxlib.0.26.0
-> installed ppx_deriving.5.2.1
-> installed coq-mathcomp-ssreflect.dev
-> installed coq-mathcomp-bigenough.dev
-> installed elpi.1.15.2
-> installed coq-mathcomp-finmap.dev
-> installed coq-mathcomp-fingroup.dev
-> installed coq-mathcomp-algebra.dev
-> installed coq-elpi.dev
-> installed coq-hierarchy-builder.dev
-> installed coq-mathcomp-solvable.dev
-> installed coq-mathcomp-field.dev
[ERROR] The compilation of coq-mathcomp-analysis failed at "/home/bench/.opam/opam-init/hooks/sandbox.sh build make -j4".
#=== ERROR while compiling coq-mathcomp-analysis.0.5.0 ========================#
# context              2.0.8 | linux/x86_64 | ocaml-base-compiler.4.12.1 | file:///home/bench/run/opam-coq-archive/released
# path                 ~/.opam/ocaml-base-compiler.4.12.1/.opam-switch/build/coq-mathcomp-analysis.0.5.0
# command              ~/.opam/opam-init/hooks/sandbox.sh build make -j4
# exit-code            2
# env-file             ~/.opam/log/coq-mathcomp-analysis-22455-2bfeb4.env
# output-file          ~/.opam/log/coq-mathcomp-analysis-22455-2bfeb4.out
### output ###
# [...]
# File "./theories/forms.v", line 124, characters 0-52:
# Warning: class_of_axiom does not respect the uniform inheritance condition.
# [uniform-inheritance,typechecker]
# File "./theories/forms.v", line 140, characters 0-48:
# Warning: additiver does not respect the uniform inheritance condition.
# [uniform-inheritance,typechecker]
# File "./theories/forms.v", line 141, characters 0-45:
# Warning: linearr does not respect the uniform inheritance condition.
# [uniform-inheritance,typechecker]
# make[1]: *** [Makefile.coq:408: all] Error 2
# make[1]: Leaving directory '/home/bench/.opam/ocaml-base-compiler.4.12.1/.opam-switch/build/coq-mathcomp-analysis.0.5.0'
# make: *** [Makefile.common:63: this-build] Error 2
<><> Error report <><><><><><><><><><><><><><><><><><><><><><><><><><><><><><><>
+- The following actions failed
| - build coq-mathcomp-analysis 0.5.0
+- 
+- The following changes have been performed
| - install coq-elpi               dev
| - install coq-hierarchy-builder  dev
| - install coq-mathcomp-algebra   dev
| - install coq-mathcomp-bigenough dev
| - install coq-mathcomp-field     dev
| - install coq-mathcomp-fingroup  dev
| - install coq-mathcomp-finmap    dev
| - install coq-mathcomp-solvable  dev
| - install coq-mathcomp-ssreflect dev
| - install cppo                   1.6.8
| - install elpi                   1.15.2
| - install menhir                 dev
| - install menhirLib              dev
| - install menhirSdk              dev
| - install ocaml-compiler-libs    v0.12.4
| - install ppx_derivers           1.2.1
| - install ppx_deriving           5.2.1
| - install ppxlib                 0.26.0
| - install re                     1.10.4
| - install result                 1.5
| - install seq                    base
| - install sexplib0               v0.15.0
| - install stdlib-shims           0.3.0
+- 
# Run eval $(opam env) to update the current shell environment
The former state can be restored with:
    opam switch import "/home/bench/.opam/ocaml-base-compiler.4.12.1/.opam-switch/backup/state-20220508102638.export"

Install ๐Ÿš€

Command
true
Return code
0
Duration
0 s

Installation size

No files were installed.

Uninstall ๐Ÿงน

Command
true
Return code
0
Missing removes
none
Wrong removes
none