ยซ Up

iris-heap-lang 3.4.0 Error with dependencies ๐Ÿš’

๐Ÿ“… (2022-05-14 08:21:45 UTC)

Context

# Packages matching: installed
# Name                # Installed # Synopsis
base-bigarray         base
base-threads          base
base-unix             base
conf-findutils        1           Virtual package relying on findutils
conf-gmp              4           Virtual package relying on a GMP lib system installation
coq                   dev         Formal proof management system
dune                  3.1.1       Fast, portable, and opinionated build system
ocaml                 4.12.1      The OCaml compiler (virtual package)
ocaml-base-compiler   4.12.1      Official release 4.12.1
ocaml-config          2           OCaml Switch Configuration
ocaml-options-vanilla 1           Ensure that OCaml is compiled with no special options enabled
ocamlfind             1.9.3       A library manager for OCaml
zarith                1.12        Implements arithmetic and logical operations over arbitrary-precision integers
# opam file:
opam-version: "2.0"
maintainer: "Ralf Jung <jung@mpi-sws.org>"
authors: "The Iris Team"
license: "BSD-3-Clause"
homepage: "https://iris-project.org/"
bug-reports: "https://gitlab.mpi-sws.org/iris/iris/issues"
dev-repo: "git+https://gitlab.mpi-sws.org/iris/iris.git"
synopsis: "HeapLang is the canonical example language for Iris"
description: """
This package provides the iris.heap_lang Coq module.
"""
tags: [
  "date:2021-02-16"
]
depends: [
  "coq-iris" {= version}
]
build: ["./make-package" "iris_heap_lang" "-j%{jobs}%"]
install: ["./make-package" "iris_heap_lang" "install"]
url {
  src:
    "https://gitlab.mpi-sws.org/iris/iris/-/archive/iris-3.4.0.tar.gz"
  checksum:
    "sha512=f227cf2535e76315605c0dce8adeb9c0ef157a6f97e99624915331061d88ab1892dc0342fe5de1591b234fcd767496572d3bfc70bdb11ac49909bd7d403d2af9"
}

Lint

Command
true
Return code
0

Dry install ๐Ÿœ๏ธ

Dry install with the current Coq version:

Command
opam install -y --show-action coq-iris-heap-lang.3.4.0 coq.dev
Return code
0

Dry install without Coq/switch base, to test if the problem was incompatibility with the current Coq/OCaml version:

Command
true
Return code
0

Install dependencies

Command
opam list; echo; ulimit -Sv 4000000; timeout 4h opam install -y --deps-only coq-iris-heap-lang.3.4.0 coq.dev
Return code
7936
Duration
5 m 10 s
Output
# Packages matching: installed
# Name                # Installed # Synopsis
base-bigarray         base
base-threads          base
base-unix             base
conf-findutils        1           Virtual package relying on findutils
conf-gmp              4           Virtual package relying on a GMP lib system installation
coq                   dev         Formal proof management system
dune                  3.1.1       Fast, portable, and opinionated build system
ocaml                 4.12.1      The OCaml compiler (virtual package)
ocaml-base-compiler   4.12.1      Official release 4.12.1
ocaml-config          2           OCaml Switch Configuration
ocaml-options-vanilla 1           Ensure that OCaml is compiled with no special options enabled
ocamlfind             1.9.3       A library manager for OCaml
zarith                1.12        Implements arithmetic and logical operations over arbitrary-precision integers
The following actions will be performed:
  - install coq-stdpp dev
  - install coq-iris  3.4.0
===== 2 to install =====
<><> Gathering sources ><><><><><><><><><><><><><><><><><><><><><><><><><><><><>
[coq-iris.3.4.0] downloaded from https://gitlab.mpi-sws.org/iris/iris/-/archive/iris-3.4.0.tar.gz
[coq-stdpp.dev] synchronised from git+https://gitlab.mpi-sws.org/iris/stdpp.git
<><> Processing actions <><><><><><><><><><><><><><><><><><><><><><><><><><><><>
-> installed coq-stdpp.dev
[ERROR] The compilation of coq-iris failed at "/home/bench/.opam/opam-init/hooks/sandbox.sh build ./make-package iris -j4".
#=== ERROR while compiling coq-iris.3.4.0 =====================================#
# context              2.0.8 | linux/x86_64 | ocaml-base-compiler.4.12.1 | file:///home/bench/run/opam-coq-archive/released
# path                 ~/.opam/ocaml-base-compiler.4.12.1/.opam-switch/build/coq-iris.3.4.0
# command              ~/.opam/opam-init/hooks/sandbox.sh build ./make-package iris -j4
# exit-code            2
# env-file             ~/.opam/log/coq-iris-31625-8c0dd3.env
# output-file          ~/.opam/log/coq-iris-31625-8c0dd3.out
### output ###
# [...]
# m : gmap K A
# n : nat
# The term "f" has type "K โ†’ A โ†’ M" while it is expected to have type
#  "?A0 * ?B โ†’ ?C".
# 
# make[1]: *** [Makefile.package.iris:790: iris/algebra/big_op.vo] Error 1
# File "./iris/algebra/cmra.v", line 340, characters 25-42:
# Error: The reference equiv_Some_inv_r' was not found in the current
# environment.
# 
# make[1]: *** [Makefile.package.iris:790: iris/algebra/cmra.vo] Error 1
# make: *** [Makefile.package.iris:408: all] Error 2
<><> Error report <><><><><><><><><><><><><><><><><><><><><><><><><><><><><><><>
+- The following actions failed
| - build coq-iris 3.4.0
+- 
+- The following changes have been performed
| - install coq-stdpp dev
+- 
# Run eval $(opam env) to update the current shell environment
The former state can be restored with:
    opam switch import "/home/bench/.opam/ocaml-base-compiler.4.12.1/.opam-switch/backup/state-20220507172434.export"

Install ๐Ÿš€

Command
true
Return code
0
Duration
0 s

Installation size

No files were installed.

Uninstall ๐Ÿงน

Command
true
Return code
0
Missing removes
none
Wrong removes
none