ยซ Up

lazy-pcf dev Error ๐Ÿ”ฅ

๐Ÿ“… (2022-05-14 08:21:45 UTC)

Context

# Packages matching: installed
# Name                # Installed # Synopsis
base-bigarray         base
base-threads          base
base-unix             base
conf-findutils        1           Virtual package relying on findutils
conf-gmp              4           Virtual package relying on a GMP lib system installation
coq                   dev         Formal proof management system
dune                  3.1.1       Fast, portable, and opinionated build system
ocaml                 4.12.1      The OCaml compiler (virtual package)
ocaml-base-compiler   4.12.1      Official release 4.12.1
ocaml-config          2           OCaml Switch Configuration
ocaml-options-vanilla 1           Ensure that OCaml is compiled with no special options enabled
ocamlfind             1.9.3       A library manager for OCaml
zarith                1.12        Implements arithmetic and logical operations over arbitrary-precision integers
# opam file:
opam-version: "2.0"
maintainer: "dev@clarus.me"
homepage: "https://github.com/coq-contribs/lazy-pcf"
license: "Proprietary"
build: [
  ["coq_makefile" "-f" "Make" "-o" "Makefile"]
  [make "-j%{jobs}%"]
]
install: [make "install"]
remove: ["rm" "-R" "%{lib}%/coq/user-contrib/lazyPCF"]
depends: [
  "ocaml"
  "coq" {= "dev"}
]
tags: [ "keyword:functional programming" "keyword:lazy evaluation" "keyword:operational" "keyword:semantics" "keyword:type soundness" "keyword:normal forms" "category:Computer Science/Lambda Calculi" ]
authors: [ "Amy Felty <>" "Jill Seaman <>" ]
synopsis: "Subject Reduction for Lazy-PCF."
description: """
An Operational Semantics of Lazy Evaluation and a Proof
of Subject Reduction"""
flags: light-uninstall
url {
  src: "git+https://github.com/coq-contribs/lazy-pcf.git#master"
}

Lint

Command
true
Return code
0

Dry install ๐Ÿœ๏ธ

Dry install with the current Coq version:

Command
opam install -y --show-action coq-lazy-pcf.dev coq.dev
Return code
0

Dry install without Coq/switch base, to test if the problem was incompatibility with the current Coq/OCaml version:

Command
true
Return code
0

Install dependencies

Command
opam list; echo; ulimit -Sv 4000000; timeout 4h opam install -y --deps-only coq-lazy-pcf.dev coq.dev
Return code
0
Duration
12 s

Install ๐Ÿš€

Command
opam list; echo; ulimit -Sv 16000000; timeout 4h opam install -y coq-lazy-pcf.dev coq.dev
Return code
7936
Duration
25 s
Output
# Packages matching: installed
# Name                # Installed # Synopsis
base-bigarray         base
base-threads          base
base-unix             base
conf-findutils        1           Virtual package relying on findutils
conf-gmp              4           Virtual package relying on a GMP lib system installation
coq                   dev         Formal proof management system
dune                  3.1.1       Fast, portable, and opinionated build system
ocaml                 4.12.1      The OCaml compiler (virtual package)
ocaml-base-compiler   4.12.1      Official release 4.12.1
ocaml-config          2           OCaml Switch Configuration
ocaml-options-vanilla 1           Ensure that OCaml is compiled with no special options enabled
ocamlfind             1.9.3       A library manager for OCaml
zarith                1.12        Implements arithmetic and logical operations over arbitrary-precision integers
[NOTE] Package coq is already installed (current version is dev).
The following actions will be performed:
  - install coq-lazy-pcf dev
<><> Gathering sources ><><><><><><><><><><><><><><><><><><><><><><><><><><><><>
[coq-lazy-pcf.dev] synchronised from git+https://github.com/coq-contribs/lazy-pcf.git#master
<><> Processing actions <><><><><><><><><><><><><><><><><><><><><><><><><><><><>
[ERROR] The compilation of coq-lazy-pcf failed at "/home/bench/.opam/opam-init/hooks/sandbox.sh build make -j4".
#=== ERROR while compiling coq-lazy-pcf.dev ===================================#
# context              2.0.8 | linux/x86_64 | ocaml-base-compiler.4.12.1 | file:///home/bench/run/opam-coq-archive/extra-dev
# path                 ~/.opam/ocaml-base-compiler.4.12.1/.opam-switch/build/coq-lazy-pcf.dev
# command              ~/.opam/opam-init/hooks/sandbox.sh build make -j4
# exit-code            2
# env-file             ~/.opam/log/coq-lazy-pcf-15203-0a5907.env
# output-file          ~/.opam/log/coq-lazy-pcf-15203-0a5907.out
### output ###
# [...]
# COQC OpSem/utils.v
# COQC SubjRed/NF.v
# File "./OpSem/utils.v", line 191, characters 32-36:
# Error: Syntax error: ',' or ')' expected after [term level 200] (in [term]).
# 
# make[1]: *** [Makefile:791: OpSem/utils.vo] Error 1
# make[1]: *** Waiting for unfinished jobs....
# File "./OpSem/environments.v", line 78, characters 41-45:
# Error: Syntax error: 'end' expected after [branches] (in [term_match]).
# 
# make[1]: *** [Makefile:790: OpSem/environments.vo] Error 1
# make: *** [Makefile:408: all] Error 2
<><> Error report <><><><><><><><><><><><><><><><><><><><><><><><><><><><><><><>
+- The following actions failed
| - build coq-lazy-pcf dev
+- 
- No changes have been performed
# Run eval $(opam env) to update the current shell environment

Installation size

No files were installed.

Uninstall ๐Ÿงน

Command
true
Return code
0
Missing removes
none
Wrong removes
none