ยซ Up

libhyps 1.0.1 Error ๐Ÿ”ฅ

๐Ÿ“… (2022-05-14 08:21:45 UTC)

Context

# Packages matching: installed
# Name                # Installed # Synopsis
base-bigarray         base
base-threads          base
base-unix             base
conf-findutils        1           Virtual package relying on findutils
conf-gmp              4           Virtual package relying on a GMP lib system installation
coq                   dev         Formal proof management system
dune                  3.1.1       Fast, portable, and opinionated build system
ocaml                 4.12.1      The OCaml compiler (virtual package)
ocaml-base-compiler   4.12.1      Official release 4.12.1
ocaml-config          2           OCaml Switch Configuration
ocaml-options-vanilla 1           Ensure that OCaml is compiled with no special options enabled
ocamlfind             1.9.3       A library manager for OCaml
zarith                1.12        Implements arithmetic and logical operations over arbitrary-precision integers
# opam file:
opam-version: "2.0"
maintainer: "Pierre.Courtieu@lecnam.net"
synopsis: "Hypotheses manipulation library"
homepage: "https://github.com/Matafou/LibHyps"
dev-repo: "git+https://github.com/Matafou/LibHyps.git"
bug-reports: "https://github.com/Matafou/LibHyps/issues"
doc: "https://github.com/Matafou/LibHyps"
license: "GPL3"
build: [
  ["./configure.sh"]
  [make "-j%{jobs}%"]
]
install: [make "install"]
depends: [
  "coq" {(>= "8.10" & < "8.14~") | (= "dev")}
]
tags: [
  "keyword:proof environment manipulation"
  "keyword:forward reasoning"
  "keyword:hypothesis naming"
]
authors: [
 "Pierre Courtieu"
]
description: "
This library defines a set of tactics to manipulate hypothesis
indivually or by group. In particular it allows to apply a tactic on
each hypothesis of a goal, or only *new* hypothesis after some tactic.
Manipulations include: automatic renaming, decomposition, extracting
premisses, but define your own manipulation on (groups of) hypothesis.
"
url {
    http: "https://github.com/Matafou/LibHyps/archive/libhyps-1.0.1.tar.gz"
    checksum: "f15584ad68bc77a5bc06048abdd9aa0d"
}

Lint

Command
true
Return code
0

Dry install ๐Ÿœ๏ธ

Dry install with the current Coq version:

Command
opam install -y --show-action coq-libhyps.1.0.1 coq.dev
Return code
0

Dry install without Coq/switch base, to test if the problem was incompatibility with the current Coq/OCaml version:

Command
true
Return code
0

Install dependencies

Command
opam list; echo; ulimit -Sv 4000000; timeout 4h opam install -y --deps-only coq-libhyps.1.0.1 coq.dev
Return code
0
Duration
11 s

Install ๐Ÿš€

Command
opam list; echo; ulimit -Sv 16000000; timeout 4h opam install -y -v coq-libhyps.1.0.1 coq.dev
Return code
7936
Duration
16 s
Output
# Packages matching: installed
# Name                # Installed # Synopsis
base-bigarray         base
base-threads          base
base-unix             base
conf-findutils        1           Virtual package relying on findutils
conf-gmp              4           Virtual package relying on a GMP lib system installation
coq                   dev         Formal proof management system
dune                  3.1.1       Fast, portable, and opinionated build system
ocaml                 4.12.1      The OCaml compiler (virtual package)
ocaml-base-compiler   4.12.1      Official release 4.12.1
ocaml-config          2           OCaml Switch Configuration
ocaml-options-vanilla 1           Ensure that OCaml is compiled with no special options enabled
ocamlfind             1.9.3       A library manager for OCaml
zarith                1.12        Implements arithmetic and logical operations over arbitrary-precision integers
[NOTE] Package coq is already installed (current version is dev).
The following actions will be performed:
  - install coq-libhyps 1.0.1
<><> Gathering sources ><><><><><><><><><><><><><><><><><><><><><><><><><><><><>
Processing  1/1: [coq-libhyps.1.0.1: http]
[coq-libhyps.1.0.1] downloaded from https://github.com/Matafou/LibHyps/archive/libhyps-1.0.1.tar.gz
Processing  1/1:
<><> Processing actions <><><><><><><><><><><><><><><><><><><><><><><><><><><><>
Processing  1/2: [coq-libhyps: ./configure.sh]
+ /home/bench/.opam/opam-init/hooks/sandbox.sh "build" "./configure.sh" (CWD=/home/bench/.opam/ocaml-base-compiler.4.12.1/.opam-switch/build/coq-libhyps.1.0.1)
Processing  1/2: [coq-libhyps: make]
+ /home/bench/.opam/opam-init/hooks/sandbox.sh "build" "make" "-j4" (CWD=/home/bench/.opam/ocaml-base-compiler.4.12.1/.opam-switch/build/coq-libhyps.1.0.1)
- COQDEP VFILES
- COQC LibHyps/LibDecomp.v
- COQC LibHyps/LibSpecialize.v
- COQC LibHyps/TacNewHyps.v
- File "./LibHyps/LibDecomp.v", line 38, characters 4-16:
- Error: The reference IF_then_else was not found in the current environment.
- 
- make[1]: *** [Makefile:790: LibHyps/LibDecomp.vo] Error 1
- make[1]: *** Waiting for unfinished jobs....
- COQC LibHyps/LibHypsNaming.v
- make: *** [Makefile:408: all] Error 2
[ERROR] The compilation of coq-libhyps failed at "/home/bench/.opam/opam-init/hooks/sandbox.sh build make -j4".
#=== ERROR while compiling coq-libhyps.1.0.1 ==================================#
# context              2.0.8 | linux/x86_64 | ocaml-base-compiler.4.12.1 | file:///home/bench/run/opam-coq-archive/released
# path                 ~/.opam/ocaml-base-compiler.4.12.1/.opam-switch/build/coq-libhyps.1.0.1
# command              ~/.opam/opam-init/hooks/sandbox.sh build make -j4
# exit-code            2
# env-file             ~/.opam/log/coq-libhyps-3507-e4db2f.env
# output-file          ~/.opam/log/coq-libhyps-3507-e4db2f.out
### output ###
# COQDEP VFILES
# COQC LibHyps/LibDecomp.v
# COQC LibHyps/LibSpecialize.v
# COQC LibHyps/TacNewHyps.v
# File "./LibHyps/LibDecomp.v", line 38, characters 4-16:
# Error: The reference IF_then_else was not found in the current environment.
# 
# make[1]: *** [Makefile:790: LibHyps/LibDecomp.vo] Error 1
# make[1]: *** Waiting for unfinished jobs....
# COQC LibHyps/LibHypsNaming.v
# make: *** [Makefile:408: all] Error 2
<><> Error report <><><><><><><><><><><><><><><><><><><><><><><><><><><><><><><>
+- The following actions failed
| - build coq-libhyps 1.0.1
+- 
- No changes have been performed
# Run eval $(opam env) to update the current shell environment
'opam install -y -v coq-libhyps.1.0.1 coq.dev' failed.

Installation size

No files were installed.

Uninstall ๐Ÿงน

Command
true
Return code
0
Missing removes
none
Wrong removes
none