« Up

mathcomp-analysis 0.3.10 Error 🔥

📅 (2022-05-14 08:21:45 UTC)

Context

# Packages matching: installed
# Name                # Installed # Synopsis
base-bigarray         base
base-threads          base
base-unix             base
conf-findutils        1           Virtual package relying on findutils
conf-gmp              4           Virtual package relying on a GMP lib system installation
coq                   dev         Formal proof management system
dune                  3.1.1       Fast, portable, and opinionated build system
ocaml                 4.12.1      The OCaml compiler (virtual package)
ocaml-base-compiler   4.12.1      Official release 4.12.1
ocaml-config          2           OCaml Switch Configuration
ocaml-options-vanilla 1           Ensure that OCaml is compiled with no special options enabled
ocamlfind             1.9.3       A library manager for OCaml
zarith                1.12        Implements arithmetic and logical operations over arbitrary-precision integers
# opam file:
opam-version: "2.0"
maintainer: "Reynald Affeldt <reynald.affeldt@aist.go.jp>"
homepage: "https://github.com/math-comp/analysis"
dev-repo: "git+https://github.com/math-comp/analysis.git"
bug-reports: "https://github.com/math-comp/analysis/issues"
license: "CECILL-C"
synopsis: "An analysis library for mathematical components"
description: """
This repository contains an experimental library for real analysis for
the Coq proof-assistant and using the Mathematical Components library."""
build: [make "-j%{jobs}%" ]
install: [make "install"]
depends: [
  "coq" { (>= "8.11" & < "8.15~") | (= "dev") }
  "coq-mathcomp-ssreflect" { (>= "1.12.0" & < "1.14~") | (= "dev") }
  "coq-mathcomp-fingroup" { (>= "1.12.0" & < "1.14~") | (= "dev") }
  "coq-mathcomp-algebra" { (>= "1.12.0" & < "1.14~") | (= "dev") }
  "coq-mathcomp-solvable" { (>= "1.12.0" & < "1.14~") | (= "dev") }
  "coq-mathcomp-field" { (>= "1.12.0" & < "1.14~") | (= "dev") }
  "coq-mathcomp-finmap" { (>= "1.5.1" & < "1.6~") | (= "dev") }
  "coq-mathcomp-bigenough" { (>= "1.0.0") }
  "coq-hierarchy-builder" { >= "0.10.0" | (= "dev") }
]
tags: [
  "category:Mathematics/Real Calculus and Topology"
  "keyword:analysis"
  "keyword:topology"
  "keyword:real numbers"
  "date:2021-08-11"
  "logpath:mathcomp.analysis"
]
authors: [
  "Reynald Affeldt"
  "Cyril Cohen"
  "Marie Kerjean"
  "Assia Mahboubi"
  "Damien Rouhling"
  "Pierre Roux"
  "Kazuhiko Sakaguchi"
  "Pierre-Yves Strub"
  "Laurent Théry"
]
url {
  http: "https://github.com/math-comp/analysis/archive/0.3.10.tar.gz"
  checksum: "sha512=1ec7e28083affbe56d878e7dca08cecd4764459657ff35a3b4541087285bdb64b42db5db9f6165ec4583c4283967acf87261cc177079eafe7f60f2c0ae7751a4"
}

Lint

Command
true
Return code
0

Dry install 🏜️

Dry install with the current Coq version:

Command
opam install -y --show-action coq-mathcomp-analysis.0.3.10 coq.dev
Return code
0

Dry install without Coq/switch base, to test if the problem was incompatibility with the current Coq/OCaml version:

Command
true
Return code
0

Install dependencies

Command
opam list; echo; ulimit -Sv 4000000; timeout 4h opam install -y --deps-only coq-mathcomp-analysis.0.3.10 coq.dev
Return code
0
Duration
38 m 45 s

Install 🚀

Command
opam list; echo; ulimit -Sv 16000000; timeout 4h opam install -y -v coq-mathcomp-analysis.0.3.10 coq.dev
Return code
7936
Duration
1 m 0 s
Output
# Packages matching: installed
# Name                 # Installed # Synopsis
base-bigarray          base
base-threads           base
base-unix              base
conf-findutils         1           Virtual package relying on findutils
conf-gmp               4           Virtual package relying on a GMP lib system installation
coq                    dev         Formal proof management system
coq-elpi               dev         Elpi extension language for Coq
coq-hierarchy-builder  dev         High level commands to declare and evolve a hierarchy based on packed classes
coq-mathcomp-algebra   dev         Mathematical Components Library on Algebra
coq-mathcomp-bigenough dev         A small library to do epsilon - N reasonning
coq-mathcomp-field     dev         Mathematical Components Library on Fields
coq-mathcomp-fingroup  dev         Mathematical Components Library on finite groups
coq-mathcomp-finmap    dev         Finite sets, finite maps, finitely supported functions
coq-mathcomp-solvable  dev         Mathematical Components Library on finite groups (II)
coq-mathcomp-ssreflect dev         Small Scale Reflection
cppo                   1.6.8       Code preprocessor like cpp for OCaml
dune                   3.1.1       Fast, portable, and opinionated build system
elpi                   1.15.2      ELPI - Embeddable λProlog Interpreter
menhir                 dev         An LR(1) parser generator
menhirLib              dev         Runtime support library for parsers generated by Menhir
menhirSdk              dev         Compile-time library for auxiliary tools related to Menhir
ocaml                  4.12.1      The OCaml compiler (virtual package)
ocaml-base-compiler    4.12.1      Official release 4.12.1
ocaml-compiler-libs    v0.12.4     OCaml compiler libraries repackaged
ocaml-config           2           OCaml Switch Configuration
ocaml-options-vanilla  1           Ensure that OCaml is compiled with no special options enabled
ocamlfind              1.9.3       A library manager for OCaml
ppx_derivers           1.2.1       Shared [@@deriving] plugin registry
ppx_deriving           5.2.1       Type-driven code generation for OCaml
ppxlib                 0.26.0      Standard library for ppx rewriters
re                     1.10.4      RE is a regular expression library for OCaml
result                 1.5         Compatibility Result module
seq                    base        Compatibility package for OCaml's standard iterator type starting from 4.07.
sexplib0               v0.15.0     Library containing the definition of S-expressions and some base converters
stdlib-shims           0.3.0       Backport some of the new stdlib features to older compiler
zarith                 1.12        Implements arithmetic and logical operations over arbitrary-precision integers
[NOTE] Package coq is already installed (current version is dev).
The following actions will be performed:
  - install coq-mathcomp-analysis 0.3.10
<><> Gathering sources ><><><><><><><><><><><><><><><><><><><><><><><><><><><><>
Processing  1/1: [coq-mathcomp-analysis.0.3.10: http]
[coq-mathcomp-analysis.0.3.10] downloaded from https://github.com/math-comp/analysis/archive/0.3.10.tar.gz
Processing  1/1:
<><> Processing actions <><><><><><><><><><><><><><><><><><><><><><><><><><><><>
Processing  1/2: [coq-mathcomp-analysis: make]
+ /home/bench/.opam/opam-init/hooks/sandbox.sh "build" "make" "-j4" (CWD=/home/bench/.opam/ocaml-base-compiler.4.12.1/.opam-switch/build/coq-mathcomp-analysis.0.3.10)
- /home/bench/.opam/ocaml-base-compiler.4.12.1/bin/coq_makefile  -f _CoqProject -o Makefile.coq
- make -f Makefile.coq 
- make[1]: Entering directory '/home/bench/.opam/ocaml-base-compiler.4.12.1/.opam-switch/build/coq-mathcomp-analysis.0.3.10'
- COQDEP VFILES
- COQC theories/boolp.v
- COQC theories/forms.v
- COQC theories/altreals/xfinmap.v
- COQC theories/classical_sets.v
- COQC theories/nngnum.v
- File "./theories/forms.v", line 126, characters 0-52:
- Warning: class_of_axiom does not respect the uniform inheritance condition.
- [uniform-inheritance,typechecker]
- File "./theories/forms.v", line 142, characters 0-48:
- Warning: additiver does not respect the uniform inheritance condition.
- [uniform-inheritance,typechecker]
- File "./theories/forms.v", line 143, characters 0-45:
- Warning: linearr does not respect the uniform inheritance condition.
- [uniform-inheritance,typechecker]
- File "./theories/forms.v", line 144, characters 0-20:
- Warning: Ignoring canonical projection to apply by GRing.Additive.apply in
- additiver: redundant with additiver
- [redundant-canonical-projection,typechecker]
- File "./theories/forms.v", line 145, characters 0-18:
- Warning: Ignoring canonical projection to apply by GRing.Linear.apply in
- linearr: redundant with linearr [redundant-canonical-projection,typechecker]
- File "./theories/forms.v", line 146, characters 0-20:
- Warning: Ignoring canonical projection to applyr_head by GRing.Additive.apply
- in additivel: redundant with additivel
- [redundant-canonical-projection,typechecker]
- File "./theories/forms.v", line 147, characters 0-18:
- Warning: Ignoring canonical projection to applyr_head by GRing.Linear.apply
- in linearl: redundant with linearl
- [redundant-canonical-projection,typechecker]
- File "./theories/nngnum.v", line 88, characters 0-25:
- Warning: Ignoring canonical projection to NngNumDef by Sub in nngnum_subType:
- redundant with nngnum_subType [redundant-canonical-projection,typechecker]
- File "./theories/nngnum.v", line 88, characters 0-25:
- Warning: Ignoring canonical projection to num_of_nng by val in
- nngnum_subType: redundant with nngnum_subType
- [redundant-canonical-projection,typechecker]
- File "./theories/nngnum.v", line 88, characters 0-25:
- Warning: Ignoring canonical projection to nngnum_of by sub_sort in
- nngnum_subType: redundant with nngnum_subType
- [redundant-canonical-projection,typechecker]
- File "./theories/nngnum.v", line 89, characters 0-24:
- Warning: Ignoring canonical projection to nngnum_of by Equality.sort in
- nngnum_eqType: redundant with nngnum_eqType
- [redundant-canonical-projection,typechecker]
- File "./theories/nngnum.v", line 90, characters 0-28:
- Warning: Ignoring canonical projection to nngnum_of by Choice.sort in
- nngnum_choiceType: redundant with nngnum_choiceType
- [redundant-canonical-projection,typechecker]
- File "./theories/nngnum.v", line 91, characters 0-28:
- Warning: Ignoring canonical projection to nngnum_of by Order.POrder.sort in
- nngnum_porderType: redundant with nngnum_porderType
- [redundant-canonical-projection,typechecker]
- File "./theories/nngnum.v", line 92, characters 0-29:
- Warning: Ignoring canonical projection to nngnum_of by Order.Lattice.sort in
- nngnum_latticeType: redundant with nngnum_latticeType
- [redundant-canonical-projection,typechecker]
- File "./theories/nngnum.v", line 93, characters 0-27:
- Warning: Ignoring canonical projection to nngnum_of by Order.Total.sort in
- nngnum_orderType: redundant with nngnum_orderType
- [redundant-canonical-projection,typechecker]
- COQC theories/posnum.v
- COQC theories/prodnormedzmodule.v
- File "./theories/prodnormedzmodule.v", line 56, characters 0-25:
- Warning: Ignoring canonical projection to prod by Num.NormedZmodule.sort in
- @normedZmodType: redundant with @normedZmodType
- [redundant-canonical-projection,typechecker]
- COQC theories/cardinality.v
- COQC theories/reals.v
- COQC theories/topology.v
- COQC theories/altreals/discrete.v
- File "./theories/cardinality.v", line 959, characters 64-73:
- Warning: Notation enum_ordS is deprecated since mathcomp 1.15.0.
- Use enum_ordSl instead. [deprecated-syntactic-definition,deprecated]
- File "./theories/cardinality.v", line 959, characters 64-73:
- Warning: Notation enum_ordS is deprecated since mathcomp 1.15.0.
- Use enum_ordSl instead. [deprecated-syntactic-definition,deprecated]
- File "./theories/cardinality.v", line 959, characters 64-73:
- Warning: Notation enum_ordS is deprecated since mathcomp 1.15.0.
- Use enum_ordSl instead. [deprecated-syntactic-definition,deprecated]
- File "./theories/cardinality.v", line 982, characters 35-44:
- Warning: Notation enum_ordS is deprecated since mathcomp 1.15.0.
- Use enum_ordSl instead. [deprecated-syntactic-definition,deprecated]
- File "./theories/cardinality.v", line 982, characters 35-44:
- Warning: Notation enum_ordS is deprecated since mathcomp 1.15.0.
- Use enum_ordSl instead. [deprecated-syntactic-definition,deprecated]
- File "./theories/cardinality.v", line 982, characters 35-44:
- Warning: Notation enum_ordS is deprecated since mathcomp 1.15.0.
- Use enum_ordSl instead. [deprecated-syntactic-definition,deprecated]
- File "./theories/cardinality.v", line 983, characters 19-28:
- Warning: Notation enum_ordS is deprecated since mathcomp 1.15.0.
- Use enum_ordSl instead. [deprecated-syntactic-definition,deprecated]
- File "./theories/cardinality.v", line 983, characters 19-28:
- Warning: Notation enum_ordS is deprecated since mathcomp 1.15.0.
- Use enum_ordSl instead. [deprecated-syntactic-definition,deprecated]
- File "./theories/cardinality.v", line 983, characters 19-28:
- Warning: Notation enum_ordS is deprecated since mathcomp 1.15.0.
- Use enum_ordSl instead. [deprecated-syntactic-definition,deprecated]
- File "./theories/cardinality.v", line 1071, characters 64-73:
- Warning: Notation enum_ordS is deprecated since mathcomp 1.15.0.
- Use enum_ordSl instead. [deprecated-syntactic-definition,deprecated]
- File "./theories/cardinality.v", line 1071, characters 64-73:
- Warning: Notation enum_ordS is deprecated since mathcomp 1.15.0.
- Use enum_ordSl instead. [deprecated-syntactic-definition,deprecated]
- File "./theories/cardinality.v", line 1071, characters 64-73:
- Warning: Notation enum_ordS is deprecated since mathcomp 1.15.0.
- Use enum_ordSl instead. [deprecated-syntactic-definition,deprecated]
- File "./theories/topology.v", line 656, characters 0-133:
- Warning:
- A coercion will be introduced in future versions when using ':>' in 'Class' declarations. Use '#[global] Existing Instance field.' instead if you don't want the coercion.
- [future-coercion-class-field,records]
- File "./theories/topology.v", line 682, characters 0-31:
- Warning: The default value for instance locality is currently "local" in a
- section and "global" otherwise, but is scheduled to change in a future
- release. For the time being, adding instances outside of sections without
- specifying an explicit locality attribute is therefore deprecated. It is
- recommended to use "export" whenever possible. Use the attributes #[local],
- #[global] and #[export] depending on your choice. For example: "#[export]
- Instance Foo : Bar := baz." [deprecated-instance-without-locality,deprecated]
- File "./theories/topology.v", line 693, characters 0-32:
- Warning: The default value for instance locality is currently "local" in a
- section and "global" otherwise, but is scheduled to change in a future
- release. For the time being, adding instances outside of sections without
- specifying an explicit locality attribute is therefore deprecated. It is
- recommended to use "export" whenever possible. Use the attributes #[local],
- #[global] and #[export] depending on your choice. For example: "#[export]
- Instance Foo : Bar := baz." [deprecated-instance-without-locality,deprecated]
- File "./theories/topology.v", line 868, characters 0-27:
- Error: No such goal.
- 
- make[2]: *** [Makefile.coq:790: theories/topology.vo] Error 1
- make[2]: *** Waiting for unfinished jobs....
- make[1]: *** [Makefile.coq:408: all] Error 2
- make[1]: Leaving directory '/home/bench/.opam/ocaml-base-compiler.4.12.1/.opam-switch/build/coq-mathcomp-analysis.0.3.10'
- make: *** [Makefile.common:63: this-build] Error 2
[ERROR] The compilation of coq-mathcomp-analysis failed at "/home/bench/.opam/opam-init/hooks/sandbox.sh build make -j4".
#=== ERROR while compiling coq-mathcomp-analysis.0.3.10 =======================#
# context              2.0.8 | linux/x86_64 | ocaml-base-compiler.4.12.1 | file:///home/bench/run/opam-coq-archive/released
# path                 ~/.opam/ocaml-base-compiler.4.12.1/.opam-switch/build/coq-mathcomp-analysis.0.3.10
# command              ~/.opam/opam-init/hooks/sandbox.sh build make -j4
# exit-code            2
# env-file             ~/.opam/log/coq-mathcomp-analysis-26041-335865.env
# output-file          ~/.opam/log/coq-mathcomp-analysis-26041-335865.out
### output ###
# [...]
# specifying an explicit locality attribute is therefore deprecated. It is
# recommended to use "export" whenever possible. Use the attributes #[local],
# #[global] and #[export] depending on your choice. For example: "#[export]
# Instance Foo : Bar := baz." [deprecated-instance-without-locality,deprecated]
# File "./theories/topology.v", line 868, characters 0-27:
# Error: No such goal.
# 
# make[2]: *** [Makefile.coq:790: theories/topology.vo] Error 1
# make[2]: *** Waiting for unfinished jobs....
# make[1]: *** [Makefile.coq:408: all] Error 2
# make[1]: Leaving directory '/home/bench/.opam/ocaml-base-compiler.4.12.1/.opam-switch/build/coq-mathcomp-analysis.0.3.10'
# make: *** [Makefile.common:63: this-build] Error 2
<><> Error report <><><><><><><><><><><><><><><><><><><><><><><><><><><><><><><>
+- The following actions failed
| - build coq-mathcomp-analysis 0.3.10
+- 
- No changes have been performed
# Run eval $(opam env) to update the current shell environment
'opam install -y -v coq-mathcomp-analysis.0.3.10 coq.dev' failed.

Installation size

No files were installed.

Uninstall 🧹

Command
true
Return code
0
Missing removes
none
Wrong removes
none