Β« Up

mathcomp-analysis 0.5.0 Error with dependencies πŸš’

πŸ“… (2022-05-14 08:21:45 UTC)

Context

# Packages matching: installed
# Name                # Installed # Synopsis
base-bigarray         base
base-threads          base
base-unix             base
conf-findutils        1           Virtual package relying on findutils
conf-gmp              4           Virtual package relying on a GMP lib system installation
coq                   dev         Formal proof management system
dune                  3.1.1       Fast, portable, and opinionated build system
ocaml                 4.12.1      The OCaml compiler (virtual package)
ocaml-base-compiler   4.12.1      Official release 4.12.1
ocaml-config          2           OCaml Switch Configuration
ocaml-options-vanilla 1           Ensure that OCaml is compiled with no special options enabled
ocamlfind             1.9.3       A library manager for OCaml
zarith                1.12        Implements arithmetic and logical operations over arbitrary-precision integers
# opam file:
opam-version: "2.0"
maintainer: "Reynald Affeldt <reynald.affeldt@aist.go.jp>"
homepage: "https://github.com/math-comp/analysis"
dev-repo: "git+https://github.com/math-comp/analysis.git"
bug-reports: "https://github.com/math-comp/analysis/issues"
license: "CECILL-C"
synopsis: "An analysis library for mathematical components"
description: """
This repository contains an experimental library for real analysis for
the Coq proof-assistant and using the Mathematical Components library."""
build: [make "-j%{jobs}%"]
install: [make "install"]
depends: [
  "coq" { (>= "8.13" & < "8.16~") | (= "dev") }
  "coq-mathcomp-ssreflect" { (>= "1.13.0" & < "1.15~") | (= "dev") }
  "coq-mathcomp-fingroup" { (>= "1.13.0" & < "1.15~") | (= "dev") }
  "coq-mathcomp-algebra" { (>= "1.13.0" & < "1.15~") | (= "dev") }
  "coq-mathcomp-solvable" { (>= "1.13.0" & < "1.15~") | (= "dev") }
  "coq-mathcomp-field" { (>= "1.13.0" & < "1.15~") | (= "dev") }
  "coq-mathcomp-finmap" { (>= "1.5.1" & < "1.6~") | (= "dev") }
  "coq-mathcomp-bigenough" { (>= "1.0.0") }
  "coq-hierarchy-builder" { (>= "1.2.0") }
]
tags: [
  "category:Mathematics/Real Calculus and Topology"
  "keyword:analysis"
  "keyword:topology"
  "keyword:real numbers"
  "date:2022-03-23"
  "logpath:mathcomp.analysis"
]
authors: [
  "Reynald Affeldt"
  "Yves Bertot"
  "Cyril Cohen"
  "Marie Kerjean"
  "Assia Mahboubi"
  "Damien Rouhling"
  "Pierre Roux"
  "Kazuhiko Sakaguchi"
  "Zachary Stone"
  "Pierre-Yves Strub"
  "Laurent ThΓ©ry"
]
url {
  http: "https://github.com/math-comp/analysis/archive/0.5.0.tar.gz"
  checksum: "sha512=57e5ec7e71338de65f1a07a9036c6d19a3584f757be76e8375a2f984d1fd05265928113a57c44d942e0ef9be7753299240763052d60661cb59551f7abb33b1e8"
}

Lint

Command
true
Return code
0

Dry install 🏜️

Dry install with the current Coq version:

Command
opam install -y --show-action coq-mathcomp-analysis.0.5.0 coq.dev
Return code
0

Dry install without Coq/switch base, to test if the problem was incompatibility with the current Coq/OCaml version:

Command
true
Return code
0

Install dependencies

Command
opam list; echo; ulimit -Sv 4000000; timeout 4h opam install -y --deps-only coq-mathcomp-analysis.0.5.0 coq.dev
Return code
7936
Duration
47 m 9 s
Output
# Packages matching: installed
# Name                # Installed # Synopsis
base-bigarray         base
base-threads          base
base-unix             base
conf-findutils        1           Virtual package relying on findutils
conf-gmp              4           Virtual package relying on a GMP lib system installation
coq                   dev         Formal proof management system
dune                  3.1.1       Fast, portable, and opinionated build system
ocaml                 4.12.1      The OCaml compiler (virtual package)
ocaml-base-compiler   4.12.1      Official release 4.12.1
ocaml-config          2           OCaml Switch Configuration
ocaml-options-vanilla 1           Ensure that OCaml is compiled with no special options enabled
ocamlfind             1.9.3       A library manager for OCaml
zarith                1.12        Implements arithmetic and logical operations over arbitrary-precision integers
The following actions will be performed:
  - install ppx_derivers           1.2.1
  - install seq                    base
  - install sexplib0               v0.15.0
  - install cppo                   1.6.8
  - install menhirLib              dev
  - install result                 1.5
  - install coq-mathcomp-ssreflect dev
  - install ocaml-compiler-libs    v0.12.4
  - install stdlib-shims           0.3.0
  - install menhirSdk              dev
  - install re                     1.10.4
  - install coq-mathcomp-finmap    dev
  - install coq-mathcomp-fingroup  dev
  - install coq-mathcomp-bigenough dev
  - install ppxlib                 0.26.0
  - install menhir                 dev
  - install coq-mathcomp-algebra   dev
  - install ppx_deriving           5.2.1
  - install coq-mathcomp-solvable  dev
  - install elpi                   1.15.2
  - install coq-mathcomp-field     dev
  - install coq-elpi               dev
  - install coq-hierarchy-builder  dev
===== 23 to install =====
<><> Gathering sources ><><><><><><><><><><><><><><><><><><><><><><><><><><><><>
[coq-hierarchy-builder.dev] synchronised from git+https://github.com/math-comp/hierarchy-builder.git#coq-master
[coq-elpi.dev] synchronised from git+https://github.com/LPCIC/coq-elpi.git#coq-master
[coq-mathcomp-bigenough.dev] synchronised from git+https://github.com/math-comp/bigenough.git#master
[coq-mathcomp-algebra.dev] synchronised from git+https://github.com/math-comp/math-comp.git
[coq-mathcomp-fingroup.dev] synchronised from git+https://github.com/math-comp/math-comp.git
[coq-mathcomp-solvable.dev] synchronised from git+https://github.com/math-comp/math-comp.git
[coq-mathcomp-field.dev] synchronised from git+https://github.com/math-comp/math-comp.git
[cppo.1.6.8] downloaded from cache at https://opam.ocaml.org/cache
[elpi.1.15.2] downloaded from cache at https://opam.ocaml.org/cache
[coq-mathcomp-ssreflect.dev] synchronised from git+https://github.com/math-comp/math-comp.git#master
[coq-mathcomp-finmap.dev] synchronised from git+https://github.com/math-comp/finmap.git#master
[menhir.dev] synchronised from git+https://gitlab.inria.fr/fpottier/menhir.git#master
[ocaml-compiler-libs.v0.12.4] downloaded from cache at https://opam.ocaml.org/cache
[ppx_derivers.1.2.1] downloaded from cache at https://opam.ocaml.org/cache
[ppx_deriving.5.2.1] downloaded from cache at https://opam.ocaml.org/cache
[menhirLib.dev] synchronised from git+https://gitlab.inria.fr/fpottier/menhir.git#master
[menhirSdk.dev] synchronised from git+https://gitlab.inria.fr/fpottier/menhir.git#master
[result.1.5] downloaded from cache at https://opam.ocaml.org/cache
[re.1.10.4] downloaded from cache at https://opam.ocaml.org/cache
[ppxlib.0.26.0] downloaded from cache at https://opam.ocaml.org/cache
[sexplib0.v0.15.0] downloaded from cache at https://opam.ocaml.org/cache
[stdlib-shims.0.3.0] downloaded from cache at https://opam.ocaml.org/cache
<><> Processing actions <><><><><><><><><><><><><><><><><><><><><><><><><><><><>
-> installed cppo.1.6.8
-> installed menhirLib.dev
-> installed menhirSdk.dev
-> installed ocaml-compiler-libs.v0.12.4
-> installed ppx_derivers.1.2.1
-> installed result.1.5
-> installed seq.base
-> installed sexplib0.v0.15.0
-> installed stdlib-shims.0.3.0
-> installed re.1.10.4
-> installed ppxlib.0.26.0
-> installed menhir.dev
-> installed ppx_deriving.5.2.1
-> installed coq-mathcomp-ssreflect.dev
-> installed coq-mathcomp-bigenough.dev
-> installed elpi.1.15.2
[ERROR] The compilation of coq-elpi failed at "/home/bench/.opam/opam-init/hooks/sandbox.sh build make COQBIN=/home/bench/.opam/ocaml-base-compiler.4.12.1/bin/ ELPIDIR=/home/bench/.opam/ocaml-base-compiler.4.12.1/lib/elpi OCAMLWARN=".
-> installed coq-mathcomp-finmap.dev
-> installed coq-mathcomp-fingroup.dev
-> installed coq-mathcomp-algebra.dev
-> installed coq-mathcomp-solvable.dev
-> installed coq-mathcomp-field.dev
#=== ERROR while compiling coq-elpi.dev =======================================#
# context              2.0.8 | linux/x86_64 | ocaml-base-compiler.4.12.1 | file:///home/bench/run/opam-coq-archive/extra-dev
# path                 ~/.opam/ocaml-base-compiler.4.12.1/.opam-switch/build/coq-elpi.dev
# command              ~/.opam/opam-init/hooks/sandbox.sh build make COQBIN=/home/bench/.opam/ocaml-base-compiler.4.12.1/bin/ ELPIDIR=/home/bench/.opam/ocaml-base-compiler.4.12.1/lib/elpi OCAMLWARN=
# exit-code            2
# env-file             ~/.opam/log/coq-elpi-28736-bac9e3.env
# output-file          ~/.opam/log/coq-elpi-28736-bac9e3.out
### output ###
# [...]
# CAMLC -c src/coq_elpi_glob_quotation.ml
# CAMLC -c src/coq_elpi_arg_HOAS.ml
# CAMLC -c src/coq_elpi_builtins_HOAS.ml
# CAMLC -c src/coq_elpi_builtins.ml
# File "src/coq_elpi_builtins.ml", line 1753, characters 39-49:
# 1753 |      Declaremods.import_module ~export:Lib.Import Libobject.unfiltered mp;
#                                               ^^^^^^^^^^
# Error: Unbound constructor Lib.Import
# make[2]: *** [Makefile.coq:734: src/coq_elpi_builtins.cmo] Error 2
# make[1]: *** [Makefile:50: build-core] Error 2
# make[1]: Leaving directory '/home/bench/.opam/ocaml-base-compiler.4.12.1/.opam-switch/build/coq-elpi.dev'
# make: *** [Makefile:42: all] Error 2
<><> Error report <><><><><><><><><><><><><><><><><><><><><><><><><><><><><><><>
+- The following actions failed
| - build coq-elpi dev
+- 
+- The following changes have been performed (the rest was aborted)
| - install coq-mathcomp-algebra   dev
| - install coq-mathcomp-bigenough dev
| - install coq-mathcomp-field     dev
| - install coq-mathcomp-fingroup  dev
| - install coq-mathcomp-finmap    dev
| - install coq-mathcomp-solvable  dev
| - install coq-mathcomp-ssreflect dev
| - install cppo                   1.6.8
| - install elpi                   1.15.2
| - install menhir                 dev
| - install menhirLib              dev
| - install menhirSdk              dev
| - install ocaml-compiler-libs    v0.12.4
| - install ppx_derivers           1.2.1
| - install ppx_deriving           5.2.1
| - install ppxlib                 0.26.0
| - install re                     1.10.4
| - install result                 1.5
| - install seq                    base
| - install sexplib0               v0.15.0
| - install stdlib-shims           0.3.0
+- 
# Run eval $(opam env) to update the current shell environment
The former state can be restored with:
    opam switch import "/home/bench/.opam/ocaml-base-compiler.4.12.1/.opam-switch/backup/state-20220512184244.export"

Install πŸš€

Command
true
Return code
0
Duration
0 s

Installation size

No files were installed.

Uninstall 🧹

Command
true
Return code
0
Missing removes
none
Wrong removes
none