ยซ Up

reduction-effects 0.1.3 Error ๐Ÿ”ฅ

๐Ÿ“… (2022-05-14 08:21:45 UTC)

Context

# Packages matching: installed
# Name                # Installed # Synopsis
base-bigarray         base
base-threads          base
base-unix             base
conf-findutils        1           Virtual package relying on findutils
conf-gmp              4           Virtual package relying on a GMP lib system installation
coq                   dev         Formal proof management system
dune                  3.1.1       Fast, portable, and opinionated build system
ocaml                 4.12.1      The OCaml compiler (virtual package)
ocaml-base-compiler   4.12.1      Official release 4.12.1
ocaml-config          2           OCaml Switch Configuration
ocaml-options-vanilla 1           Ensure that OCaml is compiled with no special options enabled
ocamlfind             1.9.3       A library manager for OCaml
zarith                1.12        Implements arithmetic and logical operations over arbitrary-precision integers
# opam file:
opam-version: "2.0"
maintainer: "Yishuai Li <yishuai@cis.upenn.edu>"
homepage: "https://github.com/coq-community/reduction-effects"
dev-repo: "git+https://github.com/coq-community/reduction-effects.git"
bug-reports: "https://github.com/coq-community/reduction-effects/issues"
license: "MPL-2.0"
synopsis: "A Coq plugin to add reduction side effects to some Coq reduction strategies"
build:   [make "-j%{jobs}%"]
install: [make "install"]
run-test:[make "-j%{jobs}%" "test"]
depends: [
  "coq" { >= "8.10" }
]
tags: [
  "logpath:ReductionEffect"
]
authors: [
  "Hugo Herbelin"
]
url {
  src:
    "https://github.com/coq-community/reduction-effects/archive/v0.1.3.tar.gz"
  checksum: [
    "md5=d35d53ce952676472249feba84ac5c53"
    "sha512=7c3144e7f7d54374e7a9d8ce88584c385294cb69c4f66db6aadceb1975be834969d0a5f1acf10459fb117b35df6924d8d879f708068a60e9f835514e0798e5d1"
  ]
}

Lint

Command
true
Return code
0

Dry install ๐Ÿœ๏ธ

Dry install with the current Coq version:

Command
opam install -y --show-action coq-reduction-effects.0.1.3 coq.dev
Return code
0

Dry install without Coq/switch base, to test if the problem was incompatibility with the current Coq/OCaml version:

Command
true
Return code
0

Install dependencies

Command
opam list; echo; ulimit -Sv 4000000; timeout 4h opam install -y --deps-only coq-reduction-effects.0.1.3 coq.dev
Return code
0
Duration
12 s

Install ๐Ÿš€

Command
opam list; echo; ulimit -Sv 16000000; timeout 4h opam install -y -v coq-reduction-effects.0.1.3 coq.dev
Return code
7936
Duration
15 s
Output
# Packages matching: installed
# Name                # Installed # Synopsis
base-bigarray         base
base-threads          base
base-unix             base
conf-findutils        1           Virtual package relying on findutils
conf-gmp              4           Virtual package relying on a GMP lib system installation
coq                   dev         Formal proof management system
dune                  3.1.1       Fast, portable, and opinionated build system
ocaml                 4.12.1      The OCaml compiler (virtual package)
ocaml-base-compiler   4.12.1      Official release 4.12.1
ocaml-config          2           OCaml Switch Configuration
ocaml-options-vanilla 1           Ensure that OCaml is compiled with no special options enabled
ocamlfind             1.9.3       A library manager for OCaml
zarith                1.12        Implements arithmetic and logical operations over arbitrary-precision integers
[NOTE] Package coq is already installed (current version is dev).
The following actions will be performed:
  - install coq-reduction-effects 0.1.3
<><> Gathering sources ><><><><><><><><><><><><><><><><><><><><><><><><><><><><>
Processing  1/1: [coq-reduction-effects.0.1.3: http]
[coq-reduction-effects.0.1.3] downloaded from https://github.com/coq-community/reduction-effects/archive/v0.1.3.tar.gz
Processing  1/1:
<><> Processing actions <><><><><><><><><><><><><><><><><><><><><><><><><><><><>
Processing  1/2: [coq-reduction-effects: make]
+ /home/bench/.opam/opam-init/hooks/sandbox.sh "build" "make" "-j4" (CWD=/home/bench/.opam/ocaml-base-compiler.4.12.1/.opam-switch/build/coq-reduction-effects.0.1.3)
- coq_makefile -f _CoqProject -o Makefile.coq
- Warning: it is recommended you provide a META.package-name file
- Warning: since you build plugins. See also -generate-meta-for-package.
- make -f Makefile.coq all
- make[1]: Entering directory '/home/bench/.opam/ocaml-base-compiler.4.12.1/.opam-switch/build/coq-reduction-effects.0.1.3'
- COQDEP VFILES
- COQPP redeffect.mlg
- OCAMLLIBDEP redeffect_plugin.mlpack
- CAMLDEP redeffect.ml
- *** Error: in file PrintingEffect.v, redeffect_plugin is not a valid plugin name anymore.Plugins should be loaded using their public name according to findlib,
-            for example package-name.foo and not foo_plugin.
-            If you are building with dune < 2.9.4 you must specify both
-            the legacy and the findlib plugin name as in:
-            Declare ML Module "foo_plugin:package-name.foo".
- COQDEP VFILES
- *** Error: in file PrintingEffect.v, redeffect_plugin is not a valid plugin name anymore.Plugins should be loaded using their public name according to findlib,
-            for example package-name.foo and not foo_plugin.
-            If you are building with dune < 2.9.4 you must specify both
-            the legacy and the findlib plugin name as in:
-            Declare ML Module "foo_plugin:package-name.foo".
- COQDEP VFILES
- *** Error: in file PrintingEffect.v, redeffect_plugin is not a valid plugin name anymore.Plugins should be loaded using their public name according to findlib,
-            for example package-name.foo and not foo_plugin.
-            If you are building with dune < 2.9.4 you must specify both
-            the legacy and the findlib plugin name as in:
-            Declare ML Module "foo_plugin:package-name.foo".
- COQDEP VFILES
- *** Error: in file PrintingEffect.v, redeffect_plugin is not a valid plugin name anymore.Plugins should be loaded using their public name according to findlib,
-            for example package-name.foo and not foo_plugin.
-            If you are building with dune < 2.9.4 you must specify both
-            the legacy and the findlib plugin name as in:
-            Declare ML Module "foo_plugin:package-name.foo".
- make[2]: *** No rule to make target '.Makefile.coq.d', needed by 'PrintingEffect.vo'.  Stop.
- make[1]: *** [Makefile.coq:408: all] Error 2
- make[1]: Leaving directory '/home/bench/.opam/ocaml-base-compiler.4.12.1/.opam-switch/build/coq-reduction-effects.0.1.3'
- make: *** [Makefile:2: all] Error 2
[ERROR] The compilation of coq-reduction-effects failed at "/home/bench/.opam/opam-init/hooks/sandbox.sh build make -j4".
#=== ERROR while compiling coq-reduction-effects.0.1.3 ========================#
# context              2.0.8 | linux/x86_64 | ocaml-base-compiler.4.12.1 | file:///home/bench/run/opam-coq-archive/released
# path                 ~/.opam/ocaml-base-compiler.4.12.1/.opam-switch/build/coq-reduction-effects.0.1.3
# command              ~/.opam/opam-init/hooks/sandbox.sh build make -j4
# exit-code            2
# env-file             ~/.opam/log/coq-reduction-effects-23753-0a5907.env
# output-file          ~/.opam/log/coq-reduction-effects-23753-0a5907.out
### output ###
# *** Error: in file PrintingEffect.v, redeffect_plugin is not a valid plugin name anymore.Plugins should be loaded using their public name according to findlib,
# [...]
#            Declare ML Module "foo_plugin:package-name.foo".
# COQDEP VFILES
# *** Error: in file PrintingEffect.v, redeffect_plugin is not a valid plugin name anymore.Plugins should be loaded using their public name according to findlib,
#            for example package-name.foo and not foo_plugin.
#            If you are building with dune < 2.9.4 you must specify both
#            the legacy and the findlib plugin name as in:
#            Declare ML Module "foo_plugin:package-name.foo".
# make[2]: *** No rule to make target '.Makefile.coq.d', needed by 'PrintingEffect.vo'.  Stop.
# make[1]: *** [Makefile.coq:408: all] Error 2
# make[1]: Leaving directory '/home/bench/.opam/ocaml-base-compiler.4.12.1/.opam-switch/build/coq-reduction-effects.0.1.3'
# make: *** [Makefile:2: all] Error 2
<><> Error report <><><><><><><><><><><><><><><><><><><><><><><><><><><><><><><>
+- The following actions failed
| - build coq-reduction-effects 0.1.3
+- 
- No changes have been performed
# Run eval $(opam env) to update the current shell environment
'opam install -y -v coq-reduction-effects.0.1.3 coq.dev' failed.

Installation size

No files were installed.

Uninstall ๐Ÿงน

Command
true
Return code
0
Missing removes
none
Wrong removes
none