ยซ Up

traversable-fincontainer dev Error ๐Ÿ”ฅ

๐Ÿ“… (2022-05-14 08:21:45 UTC)

Context

# Packages matching: installed
# Name                # Installed # Synopsis
base-bigarray         base
base-threads          base
base-unix             base
conf-findutils        1           Virtual package relying on findutils
conf-gmp              4           Virtual package relying on a GMP lib system installation
coq                   dev         Formal proof management system
dune                  3.1.1       Fast, portable, and opinionated build system
ocaml                 4.12.1      The OCaml compiler (virtual package)
ocaml-base-compiler   4.12.1      Official release 4.12.1
ocaml-config          2           OCaml Switch Configuration
ocaml-options-vanilla 1           Ensure that OCaml is compiled with no special options enabled
ocamlfind             1.9.3       A library manager for OCaml
zarith                1.12        Implements arithmetic and logical operations over arbitrary-precision integers
# opam file:
opam-version: "2.0"
maintainer: "matej.kosik@inria.fr"
homepage: "https://github.com/coq-contribs/traversable-fincontainer"
license: "ASL"
build: [make "-j%{jobs}%"]
install: [make "install"]
remove: ["rm" "-R" "%{lib}%/coq/user-contrib/TraversableFincontainer"]
depends: [
  "ocaml"
  "coq" {= "dev"}
]
tags: [
  "keyword:finitary container"
  "keyword:traversable functors"
  "category:Computer Science/Data Types and Data Structures"
]
authors: [ "Russell O'Connor <oconnorr@google.com>" ]
bug-reports: "https://github.com/coq-contribs/traversable-fincontainer/issues"
dev-repo: "git+https://github.com/coq-contribs/traversable-fincontainer.git"
synopsis: "A Coq proof that all Traversable functors are isomorphic to finitary containers"
flags: light-uninstall
url {
  src:
    "git+https://github.com/coq-contribs/traversable-fincontainer.git#master"
}

Lint

Command
true
Return code
0

Dry install ๐Ÿœ๏ธ

Dry install with the current Coq version:

Command
opam install -y --show-action coq-traversable-fincontainer.dev coq.dev
Return code
0

Dry install without Coq/switch base, to test if the problem was incompatibility with the current Coq/OCaml version:

Command
true
Return code
0

Install dependencies

Command
opam list; echo; ulimit -Sv 4000000; timeout 4h opam install -y --deps-only coq-traversable-fincontainer.dev coq.dev
Return code
0
Duration
34 s

Install ๐Ÿš€

Command
opam list; echo; ulimit -Sv 16000000; timeout 4h opam install -y coq-traversable-fincontainer.dev coq.dev
Return code
7936
Duration
58 s
Output
# Packages matching: installed
# Name                # Installed # Synopsis
base-bigarray         base
base-threads          base
base-unix             base
conf-findutils        1           Virtual package relying on findutils
conf-gmp              4           Virtual package relying on a GMP lib system installation
coq                   dev         Formal proof management system
dune                  3.1.1       Fast, portable, and opinionated build system
ocaml                 4.12.1      The OCaml compiler (virtual package)
ocaml-base-compiler   4.12.1      Official release 4.12.1
ocaml-config          2           OCaml Switch Configuration
ocaml-options-vanilla 1           Ensure that OCaml is compiled with no special options enabled
ocamlfind             1.9.3       A library manager for OCaml
zarith                1.12        Implements arithmetic and logical operations over arbitrary-precision integers
[NOTE] Package coq is already installed (current version is dev).
The following actions will be performed:
  - install coq-traversable-fincontainer dev
<><> Gathering sources ><><><><><><><><><><><><><><><><><><><><><><><><><><><><>
[coq-traversable-fincontainer.dev] synchronised from git+https://github.com/coq-contribs/traversable-fincontainer.git#master
<><> Processing actions <><><><><><><><><><><><><><><><><><><><><><><><><><><><>
[ERROR] The compilation of coq-traversable-fincontainer failed at "/home/bench/.opam/opam-init/hooks/sandbox.sh build make -j4".
#=== ERROR while compiling coq-traversable-fincontainer.dev ===================#
# context              2.0.8 | linux/x86_64 | ocaml-base-compiler.4.12.1 | file:///home/bench/run/opam-coq-archive/extra-dev
# path                 ~/.opam/ocaml-base-compiler.4.12.1/.opam-switch/build/coq-traversable-fincontainer.dev
# command              ~/.opam/opam-init/hooks/sandbox.sh build make -j4
# exit-code            2
# env-file             ~/.opam/log/coq-traversable-fincontainer-25710-e4db2f.env
# output-file          ~/.opam/log/coq-traversable-fincontainer-25710-e4db2f.out
### output ###
# [...]
# In environment
# F, G : Applicative
# FG := fun a : Type => F (G a) : Type -> Type
# a : Type
# x : FG a
# x0 : G a
# The term "a" has type "Type" while it is expected to have type "Applicative".
# 
# make[2]: *** [Makefile.coq:791: decompose_traversal.vo] Error 1
# make[1]: *** [Makefile.coq:408: all] Error 2
# make[1]: Leaving directory '/home/bench/.opam/ocaml-base-compiler.4.12.1/.opam-switch/build/coq-traversable-fincontainer.dev'
# make: *** [Makefile:2: all] Error 2
<><> Error report <><><><><><><><><><><><><><><><><><><><><><><><><><><><><><><>
+- The following actions failed
| - build coq-traversable-fincontainer dev
+- 
- No changes have been performed
# Run eval $(opam env) to update the current shell environment

Installation size

No files were installed.

Uninstall ๐Ÿงน

Command
true
Return code
0
Missing removes
none
Wrong removes
none